{"text_format":"1","workbook":"xlsx","n_sheets":32,"sheets":["Form Instructions","Project Information","ProjectInfo Validation","Terms and Conditions","Equipment Input Instructions","HVAC Unitary","HVACCalcs","HVACLookups","Window Film","Cool Roof","Window Film Lookups","HVAC Chillers","Validation","Program Info Tables","VFDs","HPWH","HPWH Calcs","HPWH Validation","Guestroom Energy Management","GREM Calculations","GREM Validation","Advanced RTU Controls","ARC Calculations","ARC Validation","Inventory Instructions","Input Key","HVAC Unitary-old","Measure Code Summary","Version Tracking","Old Summary","Attribute Crosswalk","AEG Import"],"not_rendered":{"charts":0,"images":12,"macros":1,"external_links":0,"defined_names":2599,"comments":4,"pivot_tables":0},"unopened":[],"bounds":{"document_bytes":16777216,"sheet_cells":100000,"rows_first":2000,"rows_last":500,"rows_between":2000,"halvings":0,"cell_chars":16384,"cell_head_chars":4096},"cells_cut":0,"cells_raw":0,"read":"whole","date_system":"1900"}

{"sheet":"Form Instructions","index":0,"n_rows":37,"n_cols":18,"rows_kept":37,"cut":false,"hidden":false,"merged":[[28,1,28,18],[8,3,9,4],[8,15,9,16],[34,2,34,17],[36,2,36,10],[36,11,36,18],[30,1,30,18],[32,2,32,17],[25,1,25,18],[17,1,17,18],[19,1,19,8],[19,10,19,17],[20,1,20,8],[21,1,21,8],[22,1,22,8],[11,12,12,13],[29,1,29,18],[11,9,12,10],[11,6,12,7],[1,4,1,15],[20,10,22,17],[2,6,2,14],[3,6,3,14],[4,6,4,14],[14,4,14,16],[14,17,14,18],[5,6,6,7],[5,9,6,10],[5,12,6,13],[8,6,9,7],[8,9,9,10],[8,12,9,13]]}
[]
[null,null,null,null,"HVAC Application - Electronic Version"]
[null,null,null,null,null,null,"Dominion Energy South Carolina, Inc."]
[null,null,null,null,null,null,"Use Buttons Below to Navigate the Application"]
[]
[null,null,null,null,null,null,"Project Information & Signatures",null,null,"Input Instructions & Application Types",null,null,"Terms & \nConditions"]
[]
[]
[null,null,null,"HVAC Unitary",null,null,"Window Film",null,null,"Cool Roof",null,null,"HVAC Chillers",null,null,"VFDs"]
[]
[]
[null,null,null,null,null,null,"Heat Pump\nWater Heater",null,null,"Guestroom Controls",null,null,"Advanced RTU Controls"]
[]
[]
[null,null,null,null,null,null,null,null,null,null,null,null,null,null,null,null,null,"Version # 15.1"]
[]
[null,"Application and Instructions"]
[null,"The EnergyWise for Your Business Program is designed to help non-residential customers replace aging, inefficient equipment and systems with energy-efficient technologies. The program provides customers with incentives and technical assistance that will facilitate the installation of premium efficient equipment.\n\nFor each program year (December 1–November 30), EnergyWise for Your Business incentive payments are capped per Customer Federal Tax ID number at $150,000 per Project type. Details of the program, including incentive levels and technical requirements, are subject to change without prior notice. \n\nYou may go to www.DominionEnergy.com/ForYourBizSC to get the most current program information, or you may call 877-784-7234."]
[]
[null,"Eligible Participants",null,null,null,null,null,null,null,null,"Pre-Approval Requirements "]
[null,"EnergyWise for Your Business is open to all non-residential electric customers within our service territory, except for customers eligible for Rate 23 and certain large retail customers who have elected to opt out of the Demand Side Management (DSM) programs by notifying us in writing using the Opt-Out form.",null,null,null,null,null,null,null,null,"All projects require pre-approval prior to purchasing and installing any equipment except for eligible HVAC Unitary projects with total incentives less than or equal to $5,000, and Heat Pump Water Heaters with total incentives of less than or equal to $1,000.\nAfter the application has been pre-approved by us, the customer will be notified in writing, assigned a project identification number, and given any specific instructions. The customer may then purchase and install the pre-approved equipment.\n\nFor projects not requiring pre-approval, the applicant can purchase and install the qualifying equipment and submit a completed application form and supporting documentation within 60 days of the equipment’s invoice date. "]
[null,"Eligible Equipment"]
[null,"Eligible equipment and incentive amounts are listed on the Equipment Tabs.  Eligible equipment include HVAC Unitary equipment, Window Film, Cool Roof, HVAC Chillers, Variable Frequency Drives (VFDs), Heat Pump Water Heater, Guestroom Energy Management, and Advanced RTU Controls. These measures are subject to the associated technical eligibility criteria described on the individual equipment tab. All equipment must be new; used or refurbished equipment is not eligible. "]
[]
[null,"Participation Instructions"]
[null,"Please review the program Terms and Conditions tab and the Equipment Input Instructions tab for all program rules and requirements. Tabs colored Blue should be filled in by applicant.  "]
[null,"Step 1"]
[]
[null,"Complete the Project Information tab and at least one blue Equipment tab. "]
[null,"Use the Technical & Input Instructions tab as a reference for what supporting documentation is required."]
[null,"Submit Completed Applications to: EnergyExperts@SC.DominionEnergyAccount.com."]
[null,"Step 2"]
[null,null,"Applications will be processed and we will notify the customer in writing when the review is complete and funds have been reserved. Upon receipt\nof program pre-approval, customers may purchase and install their energy efficient equipment. We will notify customers if an inspection of the facility is necessary prior to pre-approval.\nNote: Any changes in the proposed equipment, quantities, or operating conditions must be approved by us prior to implementing."]
[null,"Step 3"]
[null,null,"Upon project completion, please return the signed customer acknowledgment at bottom of the pre-approval letter along with proof of purchase.   Dominion Energy South Carolina will notify customers if an inspection of the facility is necessary prior to final payment processing.\nProof of purchase must include an itemized invoice for all Energy Conservation Measures (ECMs) that may qualify for the EnergyWise for Your Business incentive. \nEach individual product or model number must include the corresponding costs and quantity. Labor and material must be listed separately when labor is included in the overall Project Costs."]
[]
[null,"Questions","If you have questions, email EnergyExperts@SC.DominionEnergyAccount.com,",null,null,null,null,null,null,null,null,"visit  www.DominionEnergy.com/ForYourBizSC or call 877-784-7234."]

{"sheet":"Project Information","index":1,"n_rows":52,"n_cols":17,"rows_kept":52,"cut":false,"hidden":false,"merged":[[3,0,3,2],[3,3,3,9],[3,10,3,12],[3,13,3,14],[4,0,4,2],[4,3,4,9],[4,10,4,12],[4,13,4,14],[0,0,0,14],[1,0,1,14],[2,0,2,2],[2,3,2,9],[2,10,2,12],[2,13,2,14],[7,0,7,14],[8,0,8,2],[8,3,8,14],[9,0,9,14],[10,0,10,2],[10,3,10,6],[10,8,10,9],[10,11,10,14],[5,0,5,2],[5,3,5,9],[5,13,5,14],[6,0,6,2],[6,3,6,9],[6,10,6,12],[6,13,6,14],[13,0,13,14],[14,0,14,14],[15,0,15,2],[15,3,15,14],[16,0,16,2],[16,3,16,14],[11,0,11,2],[11,3,11,9],[11,11,11,14],[12,0,12,2],[12,3,12,9],[12,11,12,14],[19,0,19,2],[19,3,19,9],[19,11,19,14],[20,0,20,14],[21,0,21,8],[21,9,21,14],[17,0,17,2],[17,3,17,6],[17,8,17,9],[17,11,17,14],[18,0,18,2],[18,3,18,9],[18,11,18,14],[26,0,26,2],[26,3,26,9],[26,11,26,14],[27,0,27,2],[27,3,27,9],[27,11,27,14],[22,0,22,14],[23,0,23,2],[23,3,23,14],[24,0,24,2],[24,3,24,14],[25,0,25,2],[25,3,25,6],[25,8,25,9],[25,11,25,14],[32,0,32,2],[32,3,32,9],[32,11,32,14],[33,0,33,5],[33,6,33,9],[33,10,33,12],[33,13,33,14],[28,0,28,14],[29,0,29,14],[30,0,30,2],[30,3,30,8],[31,0,31,2],[31,3,31,8],[31,9,31,12],[31,13,31,14],[41,0,41,14],[42,0,42,14],[43,0,43,14],[44,0,44,14],[45,0,45,14],[46,0,46,14],[34,1,34,14],[36,0,36,14],[37,0,37,14],[38,0,38,14],[39,0,39,14],[40,0,40,14],[49,1,49,14],[50,1,50,14],[51,0,51,9],[47,0,48,2],[47,3,48,7],[47,8,47,9],[47,10,47,14],[48,8,48,12],[48,13,48,14]]}
["Dominion Energy South Carolina, Inc. (Fill in Blue and Orange Cells Only!)"]
["PROJECT INFORMATION"]
["Application Date",null,null,null,null,null,null,null,null,null,"Expected Completion Date"]
["Company Name",null,false,null,null,null,null,null,null,null,"Electric Account # "]
["Street Address (of the facility)  ",null,false,null,null,null,null,null,null,null,"Customer Federal Tax ID "]
["City",null,false,null,null,null,null,null,null,null,"State   "," SC","Zip  "]
["Building Type (select one)",null,false,null,null,null,null,null,null,null,"Please indicate \"other\" type:"]
["CUSTOMER CONTACT INFORMATION",null,false]
["Mailing Address:"]
["(where all correspondence will be mailed, including incentive check if payment is to the customer)"]
["City   ",null,null,null,null,null,null,"State   ",null,null,"Zip"]
["Contact Person     ",null,null,null,null,null,null,null,null,null,"Title"]
["Telephone No.       ",null,null,null,null,null,null,null,null,null,"Email"]
[]
["CONTRACTOR INFORMATION"]
["Company Name  "]
["Street Address   "]
["City   ",null,null,null,null,null,null,"State   ",null,null,"Zip"]
["Contact Person     ",null,null,null,null,null,null,null,null,null,"Title"]
["Telephone No.       ",null,false,null,null,null,null,null,null,null,"Email"]
[]
["Please indicate if the Customer or Contractor should be primary point of contact for this project:"]
["ADDITIONAL PRIMARY POINT OF CONTACT (IF APPLICABLE)"]
["Company Name  "]
["Street Address   "]
["City   ",null,null,null,null,null,null,"State   ",null,null,"Zip  "]
["Contact Person     ",null,null,null,null,null,null,null,null,null,"Title"]
["Telephone No.       ",null,null,null,null,null,null,null,null,null,"Email "]
[]
["PAYMENT INFORMATION"]
["Payment to:"]
["Federal Tax ID # (of recipient)",null,null,null,null,null,null,null,null,"Tax Status of Recipient (select one)"]
["Customer Name",null,null,null,null,null,null,null,null,null,"Title"]
["Customer Signature  (if payment to contractor, Customer must type his/her name in the orange box to the right and check the box below)    ",null,null,null,null,null,null,null,null,null,"Date (XX/XX/XXXX)"]
[false,"I understand and intend that my electronic, PDF or facsimile signature be accepted and have the same force and effect as an original signature."]
[]
["Checklist & Acknowledgement"]
["APPLICATION CHECKLIST"]
["For faster application processing, please include the following items with your application:"]
["Complete application: Project Information Tab, Customer Acknowledgment checkbox, and at least 1 \"blue\" Equipment tab.",null,null,null,null,null,null,null,null,null,null,null,null,null,null,null,false]
["Electric account number at top of page. Attach copy of electric bill.",null,null,null,null,null,null,null,null,null,null,null,null,null,null,null,false]
["The most recent IRS Form W-9 completed for payment recipient. Physical signature is required on the W-9 Form. If payment is to a contractor, both the customer's and the contractor's W-9 Forms must be provided.",null,null,null,null,null,null,null,null,null,null,null,null,null,null,null,false]
["Supporting documentation to include manufacturer’s specification (cut) sheets for equipment included in this application.",null,null,null,null,null,null,null,null,null,null,null,null,null,null,null,false]
["Customer signature and proof of purchase (contractor receipts), at time of project completion. See Terms and Conditions for invoicing requirements.",null,false,null,null,null,null,null,null,null,null,null,null,null,null,null,false]
["Applications submitted for processing will be processed in the order in which they are received. Applicants will be notified as to their pre-approval status and/or any pre-inspection requirements within 10 business days from receipt of complete application. Applicants will be notified if post-installation inspections are required."]
[]
["CUSTOMER ACKNOWLEDGMENT"]
["Authorized Representative  ",null,null,null,null,null,null,null,"Title"]
[null,null,null,null,null,null,null,null,"Date (XX/XX/XXXX)"]
[false,"By checking this box and typing my name, I hereby certify that all statements made on this application are correct to the best of my knowledge and that I have read and agree to the Terms and Conditions. Furthermore, I understand and intend that my electronic, PDF or facsimile signature be accepted and have the same force and effect as an original signature.\n\nNote: Upon completion of project, Dominion Energy South Carolina, Inc. customer of record must sign and return the written pre-approval letter and provide invoices for all energy efficiency measures."]
[false,"For Projects Not Requiring Pre-Approval ≤ $5,000 for HVAC Unitary Projects or ≤ $1,000 for Heat Pump Water Heater Projects Incentive Only: \nBy checking this box and typing my name, I hereby certify that all statements made on this application are correct to the best of my knowledge and that I have read and agree to the Terms and Conditions. Furthermore, I understand and intend that my electronic, PDF or facsimile signature be accepted and have the same force and effect as an original signature.\n\nNote: Application must include supporting documentation and copy of invoice that is dated within 60 days before application date."]
["Dominion Energy South Carolina, Inc. HVAC Application - Electronic Version",null,null,null,null,null,null,null,null,null,null,null,null,"Version",15.1]

{"sheet":"ProjectInfo Validation","index":2,"n_rows":168,"n_cols":5,"rows_kept":168,"cut":false,"hidden":true,"merged":[]}
["Building Type","Primary Contact","Tax Status","Payment To","Cities"]
["Convenience/C-store","Customer","Corporation","Customer","Adams Run"]
["Fitness/Recreation","Contractor","LLC","Contractor","Aiken"]
["Grocery","Other (fill out below)","Partnership",null,"Allendale"]
["Health Facility",null,"Individual Propiertorship",null,"Arlington Estates"]
["Industrial",null,"Not for Profit",null,"Awendaw"]
["Lodging",null,null,null,"Bamberg"]
["Multifamily",null,null,null,"Barnwell"]
["Office",null,null,null,"Batesburg Leesville"]
["Religious Facility",null,null,null,"Bath"]
["Restaurant",null,null,null,"Beaufort"]
["Retail",null,null,null,"Beech Island"]
["School (K-12)",null,null,null,"Blackville"]
["School (University/College)",null,null,null,"Blair"]
["Warehouse",null,null,null,"Bluffton"]
["Other",null,null,null,"Blythewood"]
[null,null,null,null,"Bowman"]
[null,null,null,null,"Branchville"]
[null,null,null,null,"Brunson"]
[null,null,null,null,"Calhoun Falls"]
[null,null,null,null,"Cameron"]
[null,null,null,null,"Canadys"]
[null,null,null,null,"Carlisle"]
[null,null,null,null,"Cayce"]
[null,null,null,null,"Chapin"]
[null,null,null,null,"Chappels"]
[null,null,null,null,"Charleston"]
[null,null,null,null,"Childs"]
[null,null,null,null,"Clarks Hill"]
[null,null,null,null,"Columbia"]
[null,null,null,null,"Coosawatchie"]
[null,null,null,null,"Cope"]
[null,null,null,null,"Cottageville"]
[null,null,null,null,"Cross"]
[null,null,null,null,"Cross Roads"]
[null,null,null,null,"Daniel Island"]
[null,null,null,null,"Daufuskie Island"]
[null,null,null,null,"Denmark"]
[null,null,null,null,"Dorchester"]
[null,null,null,null,"Early Branch"]
[null,null,null,null,"East Lake Hills"]
[null,null,null,null,"Eastover"]
[null,null,null,null,"Edgefield"]
[null,null,null,null,"Edisto Island"]
[null,null,null,null,"Ehrhardt"]
[null,null,null,null,"Elgin"]
[null,null,null,null,"Elko"]
[null,null,null,null,"Elloree"]
[null,null,null,null,"Estill"]
[null,null,null,null,"Eutawville"]
[null,null,null,null,"Fairfax"]
[null,null,null,null,"Folly Beach"]
[null,null,null,null,"Fort Motte"]
[null,null,null,null,"Furman"]
[null,null,null,null,"Garnett"]
[null,null,null,null,"Gaston"]
[null,null,null,null,"Gifford"]
[null,null,null,null,"Gilbert"]
[null,null,null,null,"Gloverville"]
[null,null,null,null,"Goose Creek"]
[null,null,null,null,"Graniteville"]
[null,null,null,null,"Grays Hill"]
[null,null,null,null,"Green Pond"]
[null,null,null,null,"Hampton"]
[null,null,null,null,"Hanahan"]
[null,null,null,null,"Hardeeville"]
[null,null,null,null,"Harleyville"]
[null,null,null,null,"Hilda"]
[null,null,null,null,"Holly Hill"]
[null,null,null,null,"Hollywood"]
[null,null,null,null,"Hopkins"]
[null,null,null,null,"Irmo"]
[null,null,null,null,"Isle of Palms"]
[null,null,null,null,"Jackson"]
[null,null,null,null,"Jacksonboro"]
[null,null,null,null,"James Island"]
[null,null,null,null,"Jenkinsville"]
[null,null,null,null,"Johns Island"]
[null,null,null,null,"Johnston"]
[null,null,null,null,"Ladson"]
[null,null,null,null,"Ladys Island"]
[null,null,null,null,"Langley"]
[null,null,null,null,"Leesville"]
[null,null,null,null,"Lexington"]
[null,null,null,null,"Lincolnville"]
[null,null,null,null,"Little Mountain"]
[null,null,null,null,"Livingston"]
[null,null,null,null,"Lobeco"]
[null,null,null,null,"Lodge"]
[null,null,null,null,"Lugoff"]
[null,null,null,null,"Luray"]
[null,null,null,null,"Martin"]
[null,null,null,null,"Mc Clellanville"]
[null,null,null,null,"Mc Cormick"]
[null,null,null,null,"Modoc"]
[null,null,null,null,"Moncks Corner"]
[null,null,null,null,"Monetta"]
[null,null,null,null,"Montmorenci"]
[null,null,null,null,"Mount Carmel"]
[null,null,null,null,"Mount Pleasant"]
[null,null,null,null,"Muphys Estates"]
[null,null,null,null,"Newberry"]
[null,null,null,null,"North"]
[null,null,null,null,"North Augusta"]
[null,null,null,null,"North Charleston"]
[null,null,null,null,"Northeast"]
[null,null,null,null,"Norway"]
[null,null,null,null,"Oakridge"]
[null,null,null,null,"Okatie"]
[null,null,null,null,"Olar"]
[null,null,null,null,"Olympia"]
[null,null,null,null,"Orangeburg"]
[null,null,null,null,"Parksville"]
[null,null,null,null,"Peak"]
[null,null,null,null,"Pelion"]
[null,null,null,null,"Perry"]
[null,null,null,null,"Pineland"]
[null,null,null,null,"Pomaria"]
[null,null,null,null,"Pontiac"]
[null,null,null,null,"Port Royal"]
[null,null,null,null,"Prosperity"]
[null,null,null,null,"Ravenel"]
[null,null,null,null,"Reevesville"]
[null,null,null,null,"Ridge Spring"]
[null,null,null,null,"Ridgeland"]
[null,null,null,null,"Ridgeville"]
[null,null,null,null,"Ridgeway"]
[null,null,null,null,"Rosewood"]
[null,null,null,null,"Round O"]
[null,null,null,null,"Rowesville"]
[null,null,null,null,"Ruffin"]
[null,null,null,null,"Saint George"]
[null,null,null,null,"Saint Helena Island"]
[null,null,null,null,"Saluda"]
[null,null,null,null,"Santee"]
[null,null,null,null,"Scotia"]
[null,null,null,null,"Seabrook"]
[null,null,null,null,"Sheldon"]
[null,null,null,null,"Sieglers Crossroads"]
[null,null,null,null,"Smoaks"]
[null,null,null,null,"Springfield"]
[null,null,null,null,"State Park"]
[null,null,null,null,"Sullivans Island"]
[null,null,null,null,"Summerville"]
[null,null,null,null,"Swansea"]
[null,null,null,null,"Sycamore"]
[null,null,null,null,"Tillman"]
[null,null,null,null,"Trenton"]
[null,null,null,null,"Troy"]
[null,null,null,null,"Ulmer"]
[null,null,null,null,"Union"]
[null,null,null,null,"University Park"]
[null,null,null,null,"Vance"]
[null,null,null,null,"Varnville"]
[null,null,null,null,"Vaucluse"]
[null,null,null,null,"Wagener"]
[null,null,null,null,"Walterboro"]
[null,null,null,null,"Ward"]
[null,null,null,null,"Warrenville"]
[null,null,null,null,"West Columbia"]
[null,null,null,null,"White Hall"]
[null,null,null,null,"White Rock"]
[null,null,null,null,"Wildwood"]
[null,null,null,null,"Williams"]
[null,null,null,null,"Williston"]
[null,null,null,null,"Windsor"]
[null,null,null,null,"Winnsboro"]
[null,null,null,null,"Yemassee"]

{"sheet":"Terms and Conditions","index":3,"n_rows":8,"n_cols":4,"rows_kept":8,"cut":false,"hidden":false,"merged":[[0,0,0,1],[1,0,1,1],[2,3,2,4],[2,0,6,0],[2,1,6,1]]}
["Dominion Energy South Carolina, Inc."]
["TERMS AND CONDITIONS"]
["1.  Eligibility: EnergyWise for Your Business Program (“Program”) incentives are available to non-residential electric customers for the purchase and installation of qualifying energy conservation measures (ECMs) in the Dominion Energy South Carolina service territory, subject to these Terms and Conditions (T&Cs). The process of purchasing and installing ECMs for eligible Customers pursuant to the Program is referred to herein as a “Project” or “Projects”.  Customers eligible for Rate 23 and specific large retail customers who have elected to opt out of Demand Side Management programs, by notifying us in writing using the Opt-Out form provided, are not eligible to participate. Dominion Energy South Carolina and our Program implementer (“Implementer”) (together, “We”) reserve the right to deny any application that may result in our exceeding its Program budget. Program incentives are limited, offered on a first-come/first-served basis, and are subject to Project and Customer eligibility and funds availability.  For each Program year (December 1 – November 30), Program incentive payments are capped per Customer Federal tax ID number at $150,000 per Project type.\n\n2. Project Types: The Program includes the following five Project types: Lighting Projects, HVAC and Mechanical Projects, Food Service and High Efficiency Equipment Projects, Agriculture Projects and Custom Projects. Lighting projects include Projects that use the Retrofit and New Construction Lighting Application.  HVAC and Mechanical Projects include Projects listed on the HVAC Application and the Compressed Air and Motors Application including Unitary HVAC, Chillers, Heat Pump Water Heaters, Window Film, Cool Roof, Variable Frequency Drives, Guestroom Energy Management Systems, Advanced Roof Top Controls, Compressed Air Engineered Nozzles, Zero Loss Condensate Drains and High Efficiency Motors.  Food Service and High Efficiency Equipment Projects include all cooking equipment and “plug load” equipment that is incentivized under the Food Service and High-Efficiency Equipment Application. Restaurant cooking equipment, ice machines, vending machine and refrigeration controls, commercial washers/dryers, and lighting that may be included inside the aforementioned equipment are considered Food Service and High Efficiency Equipment Projects.  Agriculture Projects include all agriculture equipment that is incentivized under the Agriculture Application.  Custom Projects are Projects that can demonstrate cost effective and lasting energy efficiency and do not fall under one of the aforementioned Project types. These Projects are “custom” tailored to the Customer for each Project and cannot receive a prescriptive incentive as the savings varies widely with each Project and technology.  Building controls, Building Tune-ups, Whole Building Solutions, System Optimization, Technical Services, and new emerging technologies generally fall under this Project type.  The above examples are provided for illustrative purposes only and may not be inclusive of all Projects.\n\n3. Authorization, Program Changes, Suspension, or Cancellation: We may change the Program requirements, incentives or T&Cs, including suspending acceptance of applications or terminating the Program, at any time and without notice. In the event of a Program change, pre-approved applications will be processed to completion under the T&Cs in effect at time of pre-approval. Submission of a completed application does not entitle Customer to Program participation. For all Projects, entitlement to Program participation and our obligation to pay incentives may occur only after we have granted written authorization, which we may grant or not at its sole discretion.\n\n4.  Project Approval: Pre-approval is required for all projects except for eligible HVAC Unitary projects with total incentives less than or equal to $5,000 and Heat Pump Water Heater projects with total incentives less than or equal to $1,000. For Projects not requiring pre-approval, the customer may purchase and install the qualifying equipment and submit a completed application form, supporting documentation and invoice within 60 days of the equipment’s invoice date. For Projects requiring pre-approval, we reserve the right to inspect any Project prior to pre-approval.  For Projects requiring pre-approval, no project-related ECMs may be ordered or installed prior to the date of our pre-approval. Violation of this prohibition will disqualify the ECM for incentives. Projects must be completed by the date listed on the pre-approval notification letter (within 180 calendar days for retrofit projects or one year for new construction projects).\n\n5. Creditworthiness: An incentive payment is conditioned upon and subject to Customer maintaining its financial creditworthiness and keeping its account in good standing.   At any time prior to an issuance of an incentive check, we may request financial information to support its financial due diligence procedures. Customer agrees to assist in this reasonable financial review.  If we believe in good faith that the Customer’s account is not in good standing, or if creditworthiness of participant has been diminished, we may reject approval of an incentive payment. \n\n6.  Proof of Purchase: Prior to our verification of the ECM installation, Customer must provide copies of all invoices or other appropriate documentation that clearly verifies the costs of purchasing and installing the ECMs, including all material, labor, and equipment discounts. Invoices must indicate a verifiable breakout of all ECMs purchased for installation under the ECM incentives application, including model numbers and quantity.\n\n7.  Project Verification: We (or our Third-Party Evaluator “Evaluator”) may conduct an inspection of Customer’s facility to verify pre- and post-installation conditions or verify documentation prior to incentive payment at any time after receipt of an application. No warranty is expressed or implied by this verification. We are not obligated to pay any incentive until it has performed a satisfactory post-installation inspection. Should we determine that ECMs were not installed in accordance with the approved application, or if an unapproved ECM was installed, or if the installation was not consistent  with generally accepted engineering/construction practices, changes may be required before  payment is issued. Notwithstanding anything to the contrary, should we determine at any point  before payment of the incentive that there has been significant deviation in the type, amount, cost  or performance of the ECMs underlying this incentive commitment that were set forth in the  Program application and pre-approved, we retain the right to revoke this commitment or reduce the  final incentive amount accordingly. We reserve this right despite a satisfactory post-installation inspection. Customer agrees to provide prompt notice to us of any significant deviation in the type, amount, cost or performance of the ECMs underlying this incentive commitment that were set forth in the Program application and pre-approved by us.","8.  Customer Tax Obligation: Customer or Customer’s designated contractor is responsible for declaring and paying any and all applicable federal, state, and local taxes that may be owed on any incentive payment. Neither Dominion Energy South Carolina, Inc. nor any of its subsidiaries shall be liable for any federal, state, and local taxes that may be owed on or as a result of any incentive payment. The party receiving the incentive payment (Customer or Contractor) must complete IRS Form W-9 and submit it to us with the incentive application materials.  If payment is to a contractor, customer's W-9 must also be provided.\n\n9.  Compliance: Customer is responsible for obtaining any and all necessary licenses and permits related to the installation of ECMs. Customer also agrees to comply with all federal, state, and local laws, codes, and regulations related to the installation and disposal of all equipment.\n\n10.  Removal of Equipment: Customer agrees to remove and dispose of the equipment being replaced by the ECMs in accordance with all legal requirements. Customer agrees not to re-install any of this equipment in our service territory or transfer it to any other party for such installation.\n\n11.  Replacement of Failed Equipment: Customers who install ECMs are expected to replace any of the ECMs that fail with similar or superior energy savings equipment at Customer’s expense.\n\n12.  Evaluation Follow-up Visits: With advance notice, we reserve the right to make or to have its contractor(s) make follow-up visits to Customer facilities during the 36 months following completion of the project to provide us with an opportunity to review the operation of the ECMs for Program evaluation purposes. Customer agrees to cooperate with this effort.\n\n13.  Contractor Selection: Customer may select any contractor to perform the work contemplated by the application, even after the application is pre-approved by us. However, we reserve the right, in its sole discretion, to prohibit specific contractors from Program participation.\n\n14.  No Warranties: Dominion Energy South Carolina, Inc. does not endorse, guarantee, or warrant any particular manufacturer or product and we provide no warranties, express or implied, for any products or services, and herein specifically disclaims any such guarantees or warranties. We are not liable or responsible for any act or omission of any contractor hired by Customer. Customer’s reliance on warranties is limited to any warranties that may arise from, or be provided by contractors, vendors, etc. Customer acknowledges that neither Dominion Energy South Carolina, Inc. nor any of its consultants are responsible for ensuring that the design, engineering, and construction of the facility or installation of the ECMs are proper or comply with any particular laws (including patent laws), codes, regulations, or industry standards. We make no representations of any kind regarding the results to be achieved by the ECMs or the adequacy or safety of such measures.\n\n15.  Assumption of Risk and Limitation of Liability: Customer assumes and acknowledges all risks arising from its participation in the Program including but not limited to exposure to the novel coronavirus (“COVID-19”) and releases and discharges Dominion Energy, Inc., Dominion Energy South Carolina, its Implementer, Evaluator, and their respective officers, directors, employees and agents from any liability related thereto. Our sole obligation is limited to paying the properly qualified rebates specified herein. Neither Dominion Energy South Carolina, Inc., any of its subsidiaries, nor its Implementer or Evaluator shall be  liable to Customer or any other party for any special, indirect, consequential, or incidental damages,  regardless of the theory of recovery, caused by or arising from any activities associated with this Program.\n\n16.  Obligations between the Parties: Customer acknowledges that any contractor selected by Customer is not an agent, contractor, or subcontractor of Dominion Energy South Carolina and is an independent contractor engaged by Customer, and that we do not manage or control the contractor’s performance. We shall have no obligation to maintain, remove, or perform any work whatsoever on the ECMs installed. We shall have no liability for a contractor’s failure to perform, for failure of the energy savings measures to function, for any damage to Customer’s premises caused by the contractor, or for any and all damages to property or injuries to persons caused by or associated with the energy savings measures. \n\n17.  Miscellaneous: These T&Cs and this application, of which these T&Cs are an integral part, constitute the entire agreement between the parties and supersede all other communications, representations, and understandings.",null,{"$f":"B6","v":0}]
[]
[]
[]
[]
[null,"Version # 15.1"]

{"sheet":"Equipment Input Instructions","index":4,"n_rows":27,"n_cols":17,"rows_kept":27,"cut":false,"hidden":false,"merged":[[11,2,11,16],[12,2,12,16],[21,2,21,16],[26,3,26,4],[26,5,26,16],[19,3,19,16],[20,3,20,16],[25,3,25,16],[10,5,10,15],[10,16,10,17],[1,5,1,15],[2,7,2,15],[3,7,3,15],[4,7,4,15],[5,4,6,5],[5,7,6,8],[5,10,6,11],[5,13,6,14],[8,4,9,5],[8,7,9,8],[8,10,9,11],[8,13,9,14],[27,1,27,17],[13,3,13,16],[14,3,14,16],[15,3,15,16],[16,3,16,16],[17,3,17,16],[22,3,22,16],[23,3,23,16],[24,3,24,16],[18,3,18,16]]}
[]
[null,null,null,null,null,"HVAC Application - Electronic Version"]
[]
[]
[]
[null,null,null,null,"HVAC Unitary",null,null,"Window Film",null,null,"Cool Roof",null,null,"HVAC Chillers"]
[]
[]
[null,null,null,null,"VFDs",null,null,"Heat Pump\nWater Heater",null,null,"Guestroom Controls",null,null,"Advanced RTU Controls"]
[]
[null,null,null,null,null,null,null,null,null,null,null,null,null,null,null,null,{"$f":"\"Version # \"&'Version Tracking'!C4","v":"Version # 15.2"}]
[null,null,"Instructions"]
[null,null,"The following tabs are available Equipment tabs for the HVAC Application"]
[null,null,"▪","HVAC Unitary - Unitary and split systems, PTACs and PTHPs"]
[null,null,"▪","Window Film - Window glazing on commercial buildings"]
[null,null,"▪","HVAC Chillers - Single speed air-cooled, single speed water-cooled and variable speed water cooled"]
[null,null,"▪","Cool Roof - Reflective roof systems"]
[null,null,"▪","VFDs - For HVAC equipment"]
[null,null,"▪","HPWH - For Heat Pump Water Heaters"]
[null,null,"▪","Guestroom Energy Management- For guestroom controls"]
[null,null,"▪","Advanced RTU Controls - For advanced rooftop controls"]
[]
[null,null,"1.","Read technical requirements on each specific Equipment tab."]
[null,null,"2.","Enter make, model, quantity and other specific equipment specifications of equipment being applied for in shaded areas of applicable Equipment tab(s)"]
[null,null,"3.","Measure Code Summary tab will be automatically populated based on Equipment tab entries."]
[null,null,"4.","Application packages must be submitted by email."]
[null,null,null,"Email Address:",null,"EnergyExperts@SC.DominionEnergyAccount.com"]

{"sheet":"HVAC Unitary","index":5,"n_rows":60,"n_cols":21,"rows_kept":60,"cut":false,"hidden":false,"merged":[[47,10,47,11],[38,5,38,7],[41,5,41,7],[41,10,41,11],[42,10,42,11],[43,5,43,7],[43,10,43,11],[38,10,38,11],[39,10,39,11],[46,5,46,7],[45,5,45,7],[46,10,46,11],[19,20,20,20],[19,19,20,19],[19,15,20,15],[19,16,20,16],[19,18,20,18],[19,17,20,17],[0,0,0,13],[1,0,1,13],[2,0,2,13],[3,0,3,13],[4,0,4,13],[8,15,8,18],[39,5,39,7],[38,9,39,9],[40,5,40,7],[40,10,40,11],[19,9,19,11],[36,5,36,7],[36,10,36,11],[19,13,20,13],[19,7,20,7],[19,8,20,8],[36,12,36,13],[38,12,39,13],[15,1,16,1],[5,0,5,13],[19,12,20,12],[19,3,20,3],[19,4,20,4],[19,5,20,5],[19,6,20,6],[7,0,14,13],[6,0,6,13],[19,1,20,1],[19,2,20,2],[18,1,18,13],[47,1,47,4],[54,1,54,13],[50,1,50,13],[43,12,43,13],[42,12,42,13],[45,10,45,11],[49,5,49,7],[49,10,49,11],[51,5,53,7],[51,10,53,13],[48,10,48,11],[47,5,47,7],[49,1,49,4],[48,1,48,4],[48,5,48,7],[45,1,46,4],[49,12,49,13],[47,12,47,13],[48,12,48,13],[46,12,46,13],[45,12,45,13],[58,1,58,12],[55,1,55,4],[56,1,56,4],[57,1,57,4],[51,1,51,4],[52,1,52,4],[53,1,53,4],[55,5,57,7],[55,10,57,13],[36,1,36,4],[34,1,34,13],[35,1,35,13],[37,1,37,13],[44,1,44,13],[42,5,42,7],[40,1,40,4],[41,1,41,4],[42,1,42,4],[43,1,43,4],[38,1,39,4],[41,12,41,13],[40,12,40,13]]}
[]
[]
[]
["C&I Prescriptive - Unitary HVAC"]
[{"$f":"\"Version # \"&'Version Tracking'!C4","v":"Version # 15.2"}]
["Fill in Blue Cells Only!"]
[" HVAC UNITARY TECHNICAL REQUIREMENTS & WORKBOOK INSTRUCTIONS"]
["TECHNICAL REQUIREMENTS\n• Unitary/Single Package and split system cooling equipment must meet Air-Conditioning, Heating, and Refrigeration Institute (AHRI) standards (210/240, 320, or 340/360), be certified by a Nationally Recognized Testing Laboratory (NRTL), and use a minimum ozone-depleting refrigerant (e.g., HCFC or HFC).\n• Electric Unitary/Single Packaged units and Split Systems for Air Conditioners (AC), Air Source Heat Pumps (HP), Packaged Terminal Air Conditioners (PTAC), and Packaged Terminal Heat Pumps (PTHP) are eligible systems. \n• Qualifying Split Systems must have both a new condenser and a new coil that meet AHRI specifications. Matched system performance (condenser + coil) must meet or exceed all minimum system requirements for Tier I or Tier II listed in Table 1.\n• Unitary/Single Package, PTACs, and PTHPs being installed must meet or exceed all minimum system requirements for Tier I or Tier II listed in Table 1.\n\nWORKBOOK INSTRUCTIONS\n• In 2023, new efficiency rating systems were introduced for AC and HP units less than 65,000 BTUh (<5.4 tons) in size. When entering efficiency ratings for these size units in columns K and L, use SEER2 and HSPF2 ratings to meet the minimum efficiency requirements.\n• Energy efficiency ratings required for each type of system are list below:\n                o Air Conditioners: Unitary/Single Package and Split Systems – SEER2 for less than 5.4 tons and IEER for greater than 5.4 tons.\n                o Air Source Heat Pumps: Unitary/Single Package and Split Systems - SEER2 and HSPF2 for less than 5.4 tons and IEER for greater than 5.4 tons.\n                o Packaged Terminal Air Conditioner (PTAC) – EER for all unit sizes.\n                o Packaged Terminal Heat Pump (PTHP) – EER and COP for all unit sizes.\n• EER/EER2 ratings from the AHRI certificate must be entered in Column J on the Worksheet regardless of unit type, or whether it affects program incentive. \n• Cooling (and heating capacity where applicable) in BTUh should be acquired from the AHRI certificate and entered into the application worksheet in column H and I respectively.\n• Program Incentive will be calculated based on AHRI Cooling BTUh “Tons”- AHRI Cooling where 1 ton = 12,000 BTUh\n\nBlue cell must be filled in for calculations to determine if eligible for incentive."]
[null,null,null,null,null,null,null,null,null,null,null,null,null,null,null,"Summary Table"]
[null,null,null,null,null,null,null,null,null,null,null,null,null,null,null,"Total kWh ","Total Summer Coincident Peak (kW)","Total Winter Coincident Peak (kW)","Total Incentive"]
[null,null,null,null,null,null,null,null,null,null,null,null,null,null,null,{"$f":"SUM(P23:P32)","v":0},{"$f":"SUM(Q23:Q32)","v":0},{"$f":"SUM(R23:R32)","v":0},{"$f":"SUM(S23:S32)","v":0}]
[]
[]
[]
[]
[null,"Input Cells"]
[null,null,"Data input allowed in shaded cells only.",null,null,null,null,null,null,null,"*If print button malfunctions, "]
[null,null,null,null,null,null,null,null,null,null,null,null,null,null,null,"Hide these columns for public facing document"]
[null,"Unitary HVAC"]
[null,"Line Item","Building Type","Device Type","Manufacturer","Model #","Size (tons)","AHRI Cooling Capacity\n(BTUh)","AHRI Heating Capacity\n(BTUh)","Unit Efficiency",null,null,"Quantity","Incentive Requested",null,"Total kWh Saved","Summer Coincident Peak kW Saved","Winter Coincident Peak kW Saved","Total Incentive","Incentive per Ton or unit","Unit Qualifies"]
[null,null,null,null,null,null,null,null,null,"EER or EER2","SEER2 or IEER","HSPF2 or COP"]
[null,"Ex.","Office","Split System Heat Pump","klanvbk",32160,5,61000,56000,12.5,16,8,1,{"$f":"S22","v":0}]
[null,1,null,null,null,null,null,null,null,null,null,null,null,{"$f":"IFERROR(S23*U23,0)","v":0},null,{"$f":"HVACCalcs!AQ5","v":0},{"$f":"HVACCalcs!AR5","v":0},{"$f":"HVACCalcs!AS5","v":0},{"$f":"IFERROR(IF(VLOOKUP(D23,Validation!$C$3:$G$9,5,FALSE)=\"Unit\",M23*T23,M23*T23*G23),0)","v":0},{"$f":"HVACCalcs!AD5","v":0},{"$f":"IF(HVACCalcs!AC5=\"Yes\",1,0)","v":0}]
[null,2,null,null,null,null,null,null,null,null,null,null,null,0,null,{"$f":"HVACCalcs!AQ6","v":0},{"$f":"HVACCalcs!AR6","v":0},{"$f":"HVACCalcs!AS6","v":0},{"$f":"IFERROR(IF(VLOOKUP(D24,Validation!$C$3:$G$9,5,FALSE)=\"Unit\",M24*T24,M24*T24*G24),0)","v":0},{"$f":"HVACCalcs!AD6","v":0},{"$f":"IF(HVACCalcs!AC6=\"Yes\",1,0)","v":0}]
[null,3,null,null,null,null,null,null,null,null,null,null,null,0,null,{"$f":"HVACCalcs!AQ7","v":0},{"$f":"HVACCalcs!AR7","v":0},{"$f":"HVACCalcs!AS7","v":0},{"$f":"IFERROR(IF(VLOOKUP(D25,Validation!$C$3:$G$9,5,FALSE)=\"Unit\",M25*T25,M25*T25*G25),0)","v":0},{"$f":"HVACCalcs!AD7","v":0},{"$f":"IF(HVACCalcs!AC7=\"Yes\",1,0)","v":0}]
[null,4,null,null,null,null,null,null,null,null,null,null,null,0,null,{"$f":"HVACCalcs!AQ8","v":0},{"$f":"HVACCalcs!AR8","v":0},{"$f":"HVACCalcs!AS8","v":0},{"$f":"IFERROR(IF(VLOOKUP(D26,Validation!$C$3:$G$9,5,FALSE)=\"Unit\",M26*T26,M26*T26*G26),0)","v":0},{"$f":"HVACCalcs!AD8","v":0},{"$f":"IF(HVACCalcs!AC8=\"Yes\",1,0)","v":0}]
[null,5,null,null,null,null,null,null,null,null,null,null,null,0,null,{"$f":"HVACCalcs!AQ9","v":0},{"$f":"HVACCalcs!AR9","v":0},{"$f":"HVACCalcs!AS9","v":0},{"$f":"IFERROR(IF(VLOOKUP(D27,Validation!$C$3:$G$9,5,FALSE)=\"Unit\",M27*T27,M27*T27*G27),0)","v":0},{"$f":"HVACCalcs!AD9","v":0},{"$f":"IF(HVACCalcs!AC9=\"Yes\",1,0)","v":0}]
[null,6,null,null,null,null,null,null,null,null,null,null,null,0,null,{"$f":"HVACCalcs!AQ10","v":0},{"$f":"HVACCalcs!AR10","v":0},{"$f":"HVACCalcs!AS10","v":0},{"$f":"IFERROR(IF(VLOOKUP(D28,Validation!$C$3:$G$9,5,FALSE)=\"Unit\",M28*T28,M28*T28*G28),0)","v":0},{"$f":"HVACCalcs!AD10","v":0},{"$f":"IF(HVACCalcs!AC10=\"Yes\",1,0)","v":0}]
[null,7,null,null,null,null,null,null,null,null,null,null,null,0,null,{"$f":"HVACCalcs!AQ11","v":0},{"$f":"HVACCalcs!AR11","v":0},{"$f":"HVACCalcs!AS11","v":0},{"$f":"IFERROR(IF(VLOOKUP(D29,Validation!$C$3:$G$9,5,FALSE)=\"Unit\",M29*T29,M29*T29*G29),0)","v":0},{"$f":"HVACCalcs!AD11","v":0},{"$f":"IF(HVACCalcs!AC11=\"Yes\",1,0)","v":0}]
[null,8,null,null,null,null,null,null,null,null,null,null,null,0,null,{"$f":"HVACCalcs!AQ12","v":0},{"$f":"HVACCalcs!AR12","v":0},{"$f":"HVACCalcs!AS12","v":0},{"$f":"IFERROR(IF(VLOOKUP(D30,Validation!$C$3:$G$9,5,FALSE)=\"Unit\",M30*T30,M30*T30*G30),0)","v":0},{"$f":"HVACCalcs!AD12","v":0},{"$f":"IF(HVACCalcs!AC12=\"Yes\",1,0)","v":0}]
[null,9,null,null,null,null,null,null,null,null,null,null,null,0,null,{"$f":"HVACCalcs!AQ13","v":0},{"$f":"HVACCalcs!AR13","v":0},{"$f":"HVACCalcs!AS13","v":0},{"$f":"IFERROR(IF(VLOOKUP(D31,Validation!$C$3:$G$9,5,FALSE)=\"Unit\",M31*T31,M31*T31*G31),0)","v":0},{"$f":"HVACCalcs!AD13","v":0},{"$f":"IF(HVACCalcs!AC13=\"Yes\",1,0)","v":0}]
[null,10,null,null,null,null,null,null,null,null,null,null,null,0,null,{"$f":"HVACCalcs!AQ14","v":0},{"$f":"HVACCalcs!AR14","v":0},{"$f":"HVACCalcs!AS14","v":0},{"$f":"IFERROR(IF(VLOOKUP(D32,Validation!$C$3:$G$9,5,FALSE)=\"Unit\",M32*T32,M32*T32*G32),0)","v":0},{"$f":"HVACCalcs!AD14","v":0},{"$f":"IF(HVACCalcs!AC14=\"Yes\",1,0)","v":0}]
[null,null,null,null,null,null,null,null,null,null,null,{"$f":"IFERROR(IF('Project Information'!$N$6=\"\",\"Please fill in zip code in cell L6 on Project Information tab\",IF(OR(VLOOKUP('Project Information'!$N$6,Validation!$B$115:$D$515,3,FALSE)=\"Charleston\",VLOOKUP('Project Information'!$N$6,Validation!$B$115:$D$515,3,FALSE)=\"Columbia\"),1)),\"Ineligible zip code. Please check cell L6 on Project Information tab\")","v":"Please fill in zip code in cell L6 on Project Information tab"}]
[]
[]
[null,"TABLE 1: QUALIFYING EFFICIENCY AND INCENTIVES"]
[null,"Size Category (tons)",null,null,null,"Sub-Category",null,null,"Tier 1 Minimum Requirement","Tier 1 Incentive","Tier 2 Minimum Requirement",null,"Tier 2 Incentive"]
[null,"Air Conditioners (Cooling Mode) - Unitary and Split Systems"]
[null,"<5.4",null,null,null,"Split System",null,null,"15.2 SEER2","$75/ton","16.2 SEER2",null,"$100/ton"]
[null,null,null,null,null,"Single Package",null,null,"14.3 SEER2",null,"15.2 SEER2"]
[null,"≥ 5.4 and < 11.25",null,null,null,"Split System and Single Package",null,null,"15.3 IEER","$60/ton","15.8 IEER",null,"$75/ton"]
[null,"≥ 11.25 and < 20",null,null,null,"Split System and Single Package",null,null,"14.7 IEER","$50/ton","15.10 IEER",null,"$70/ton"]
[null,"≥ 20 and < 63.3",null,null,null,"Split System and Single Package",null,null,"13.6 IEER","$40/ton","14.10 IEER",null,"$60/ton"]
[null," ≥ 63.3",null,null,null,"Split System and Single Package",null,null,"11.6 IEER","$15/ton","12.0 IEER",null,"$20/ton"]
[null,"Air Source Heat Pumps (Cooling Mode) - Unitary and Split Systems"]
[null,"< 5.4",null,null,null,"Split System",null,null,"\n15.2 SEER2 and 7.8 HSPF2","$100/ton","\n16.2 SEER2 and 8.0 HSPF2",null,"$125/ton"]
[null,null,null,null,null,"Single Package",null,null,"\n14.3 SEER2 and 7 HSPF2","$100/ton","\n15.2 SEER2 and 7.2 HSPF2",null,"$125/ton"]
[null,"≥ 5.4 and < 11.25",null,null,null,"Split System and Single Package",null,null,"15.3 IEER","$75/ton","15.8 IEER",null,"$100/ton"]
[null,"≥ 11.25 and < 20",null,null,null,"Split System and Single Package",null,null,"14.7 IEER","$55/ton","15.10 IEER",null,"$80/ton"]
[null,"≥ 20",null,null,null,"Split System and Single Package",null,null,"13.6 IEER","$50/ton","14.10 IEER",null,"$75/ton"]
[null,"Packaged Terminal Air Conditioner (PTAC)"]
[null,"< 0.75",null,null,null,"Single Package",null,null,"12.0 EER","$20/unit"]
[null,"≥ 0.75 and < 1.0",null,null,null,null,null,null,"11.5 EER","$30/unit"]
[null,"≥ 1.0",null,null,null,null,null,null,"10.5 EER","$40/unit"]
[null,"Packaged Terminal Heat Pump (PTHP)"]
[null,"< 0.75",null,null,null,"Single Package",null,null,"12.0 EER and 3.3 COP","$40/unit"]
[null,"≥ 0.75 and < 1.0",null,null,null,null,null,null,"11.5 EER and 3.2 COP","$50/unit"]
[null,"≥ 1.0",null,null,null,null,null,null,"10.3 EER and 3.2 COP","$60/unit"]
[null,"Note: Tons are based on 12,000 BTUH net output per ton."]
[null,null,null,null,null,null,null,null,null,null,null,null,{"$f":"\"Version \"  &  'Version Tracking'!C4","v":"Version 15.2"}]

{"sheet":"HVACCalcs","index":6,"n_rows":70,"n_cols":45,"rows_kept":70,"cut":false,"hidden":true,"merged":[[2,3,3,3],[2,1,3,1],[2,2,3,2],[2,5,3,5],[2,15,2,17],[2,4,3,4],[2,14,3,14],[20,6,20,8],[2,9,3,9],[2,11,3,11],[2,12,3,12],[2,13,3,13],[2,8,3,8],[2,7,3,7],[2,10,3,10],[2,35,2,37],[2,6,3,6],[2,34,3,34],[2,33,3,33],[2,38,2,41],[2,31,3,31],[2,30,3,30],[2,32,3,32],[2,28,3,28],[2,18,2,20],[2,21,2,23],[2,24,2,26],[2,27,3,27],[2,29,3,29]]}
[]
[null,"Proposed Unit Tier Qualification",null,null,null,null,null,null,null,null,null,null,2,3,4]
[null,"Input sheet row","Device Type","System Type","System Type","Unit Tons","Nominal BTUh"," BTUh Cooling"," BTUh Heating","Size Category","Rating System","Concat","AC/HP Full Load Lookup Reference","AC/HP Full Load Lookup Reference","AC/HP Full Load Lookup Reference","Proposed Unit Efficiencies",null,null,"Baseline Efficiencies",null,null,"Tier 1 required efficiency",null,null,"Tier 2 required efficiency",null,null,"Tier Achieved","Unit Qualifies","Incentive/ton or unit for PTAC/HP","Quantity","Total Incentive","Building Type","EFLHc","EFLHh","kWh Savings/ton or unit",null,null,"kW Savings/ton or unit"]
[null,null,null,null,null,null,null,null,null,null,null,null,null,null,null,"EER","Part Load","COP","Full Load","Part Load","COP","Full Load","Part Load","COP","Full Load","Part Load","COP",null,null,null,null,null,null,null,null,"Cooling Energy Savings ","Heating Energy Savings ","Combined Energy Savings","Summer Peak CF","Summer Peak Savings ","Winter Peak CF","Winter Peak Savings","Total kWh Savings","Summer Peak Coincidence kW Savings","Winter Peak Coincidence kW Savings"]
[null,1,{"$f":"'HVAC Unitary'!D23","v":0},{"$f":"IFERROR(VLOOKUP(C5,Validation!$C$3:$E$9,3,FALSE),\"\")","v":""},{"$f":"IFERROR(VLOOKUP(C5,Validation!$C$3:$F$9,4,FALSE),\"\")","v":""},{"$f":"'HVAC Unitary'!G23","v":0},{"$f":"F5*12000","v":0},{"$f":"'HVAC Unitary'!H23","v":0},{"$f":"'HVAC Unitary'!I23","v":0},{"$f":"VLOOKUP(G5,INDIRECT(D5&\"Baseline\"),1)","v":{"$error":"#REF!"}},"New",{"$f":"_xlfn.CONCAT(D5,J5,E5,K5)","v":{"$error":"#REF!"}},{"$f":"IFERROR(IF(OR($D5=\"AC\",$D5=\"HP\"),VLOOKUP($L5,$F$23:$I$70,M$2,FALSE),0),0)","v":0},0,0,{"$f":"'HVAC Unitary'!J23","v":0},{"$f":"'HVAC Unitary'!K23","v":0},{"$f":"IF(G5>65000,'HVAC Unitary'!L23,'HVAC Unitary'!L23/IF(D5=\"PTHP\",1,3.413))","v":0},{"$f":"IF($D5=\"\",\"\",IF($D5=\"PTAC\",VLOOKUP($G5,PTACBaseline,3)+VLOOKUP($G5,PTACBaseline,4)*$G5/1000,IF($D5=\"PTHP\",VLOOKUP($G5,PTHPBaseline,3)+VLOOKUP($G5,PTHPBaseline,4)*$G5/1000,IF($D5=\"AC\",VLOOKUP($G5,ACBaseline,M5),IF($D5=\"HP\",VLOOKUP($G5,HPBaseline,M5),\"\")))))","v":""},{"$f":"IF($D5=\"\",\"\",IF($D5=\"PTAC\",0,IF($D5=\"PTHP\",0,IF($D5=\"AC\",VLOOKUP($G5,ACBaseline,N5),IF($D5=\"HP\",VLOOKUP($G5,HPBaseline,N5),\"\")))))","v":""},{"$f":"IF($D5=\"\",\"\",IF($D5=\"PTAC\",0,IF($D5=\"PTHP\",VLOOKUP($G5,PTHPBaseline,6)+VLOOKUP($G5,PTHPBaseline,7)*$G5/1000,IF($D5=\"AC\",0,IF($D5=\"HP\",VLOOKUP($G5,HPBaseline,O5),\"\")))))","v":""},{"$f":"IF($D5=\"\",\"\",IF($D5=\"PTAC\",VLOOKUP($G5,PTACMinEffT1,3),IF($D5=\"PTHP\",VLOOKUP($G5,PTHPMinEffT1,3),IF($D5=\"AC\",VLOOKUP($G5,ACMinEffT1,M5),IF($D5=\"HP\",VLOOKUP($G5,HPMinEffT1,M5),\"\")))))","v":""},{"$f":"IF($D5=\"\",\"\",IF($D5=\"PTAC\",0,IF($D5=\"PTHP\",0,IF($D5=\"AC\",VLOOKUP($G5,ACMinEffT1,N5),IF($D5=\"HP\",VLOOKUP($G5,HPMinEffT1,N5),\"\")))))","v":""},{"$f":"IF($D5=\"\",\"\",IF($D5=\"PTAC\",0,IF($D5=\"PTHP\",VLOOKUP($G5,PTHPMinEffT1,5),IF($D5=\"AC\",0,IF($D5=\"HP\",VLOOKUP($G5,HPMinEffT1,O5),\"\")))))","v":""},{"$f":"IF($D5=\"\",\"\",IF($D5=\"PTAC\",999,IF($D5=\"PTHP\",999,IF($D5=\"AC\",VLOOKUP($G5,ACMinEffT2,M5),IF($D5=\"HP\",VLOOKUP($G5,HPMinEffT2,M5),\"\")))))","v":""},{"$f":"IF($D5=\"\",\"\",IF($D5=\"PTAC\",0,IF($D5=\"PTHP\",0,IF($D5=\"AC\",VLOOKUP($G5,ACMinEffT2,N5),IF($D5=\"HP\",VLOOKUP($G5,HPMinEffT2,N5),\"\")))))","v":""},{"$f":"IF($D5=\"\",\"\",IF($D5=\"PTAC\",999,IF($D5=\"PTHP\",999,IF($D5=\"AC\",0,IF($D5=\"HP\",VLOOKUP($G5,HPMinEffT2,O5),\"\")))))","v":""},{"$f":"IFERROR(IF(OR(C5=0,F5=0),\"-\",IF(AND(P5>=Y5,Q5>=Z5,R5>=AA5),\"Tier 2\",IF(AND(P5>=V5,Q5>=W5,R5>=X5),\"Tier 1\",\"-\"))),\"-\")","v":"-"},{"$f":"IFERROR(IF(AB5=\"-\",\"No\",\"Yes\"),\"No\")","v":"No"},{"$f":"IF(D5=\"PTAC\",VLOOKUP(G5,PTACMinEffT1,5),IF(D5=\"PTHP\",VLOOKUP(G5,PTHPMinEffT1,7),IF(AB5=\"Tier 1\",IF(D5=\"AC\",VLOOKUP(G5,ACMinEffT1,15),IF(D5=\"HP\",VLOOKUP(G5,HPMinEffT1,21),4)),IF(AB5=\"Tier 2\",IF(D5=\"AC\",VLOOKUP(G5,ACMinEffT2,15),IF(D5=\"HP\",VLOOKUP(G5,HPMinEffT2,21),4)),0))))","v":0},{"$f":"'HVAC Unitary'!M23","v":0},{"$f":"AD5*AE5","v":0},{"$f":"'HVAC Unitary'!C23","v":0},{"$f":"VLOOKUP(AG5,Validation!$C$13:$G$24,IF(VLOOKUP('Project Information'!$N$6,Validation!$B$116:$D$515,3,FALSE)=\"Charleston\",4,5))","v":{"$error":"#N/A"}},{"$f":"VLOOKUP(AG5,Validation!$C$13:$G$24,IF(VLOOKUP('Project Information'!$N$6,Validation!$B$116:$D$515,3,FALSE)=\"Charleston\",2,3))","v":{"$error":"#N/A"}},{"$f":"IFERROR(IF(AC5=\"No\",0,H5/1000*(1/IF(OR(D5=\"AC\",D5=\"HP\"),T5,S5)-(1/IF(OR(D5=\"AC\",D5=\"HP\"),Q5,P5)))*AH5),0)","v":0},{"$f":"IFERROR(IF(AC5=\"No\",0,I5/3412*(1/IF(OR(D5=\"AC\",D5=\"PTAC\"),1,U5)-(1/IF(OR(D5=\"AC\",D5=\"PTAC\"),1,R5)))*AI5),0)","v":0},{"$f":"AK5+AJ5","v":0},0.8,{"$f":"IFERROR(IF(AC5=\"No\",0,H5/1000*((1/S5)-(1/P5))*AM5),0)","v":0},{"$f":"_xlfn.XLOOKUP(C5,Validation!$C$3:$C$9,Validation!$H$3:$H$9)","v":{"$error":"#N/A"}},{"$f":"IFERROR(IF(AC5=\"No\",0,IF(D5=\"HP\",I5/3412*((1/U5)-(1/R5)),H5/1000*((1/S5)-(1/P5))))*AO5,0)","v":0},{"$f":"AL5*$AE5","v":0},{"$f":"IF(AN5*$AE5 < 0, 0, AN5*$AE5)","v":0},{"$f":"IF(AP5*$AE5 < 0, 0, AP5*$AE5)","v":0}]
[null,2,{"$f":"'HVAC Unitary'!D24","v":0},{"$f":"IFERROR(VLOOKUP(C6,Validation!$C$3:$E$9,3,FALSE),\"\")","v":""},{"$f":"IFERROR(VLOOKUP(C6,Validation!$C$3:$F$9,4,FALSE),\"\")","v":""},{"$f":"'HVAC Unitary'!G24","v":0},{"$f":"F6*12000","v":0},{"$f":"'HVAC Unitary'!H24","v":0},{"$f":"'HVAC Unitary'!I24","v":0},{"$error":"#REF!"},"New",{"$error":"#REF!"},0,0,0,{"$f":"'HVAC Unitary'!J24","v":0},{"$f":"'HVAC Unitary'!K24","v":0},{"$f":"IF(G6>65000,'HVAC Unitary'!L24,'HVAC Unitary'!L24/IF(D6=\"PTHP\",1,3.413))","v":0},"","","","","","","","","","-",{"$f":"IFERROR(IF(AB6=\"-\",\"No\",\"Yes\"),\"No\")","v":"No"},0,{"$f":"'HVAC Unitary'!M24","v":0},{"$f":"AD6*AE6","v":0},{"$f":"'HVAC Unitary'!C24","v":0},{"$f":"VLOOKUP(AG6,Validation!$C$13:$G$24,IF(VLOOKUP('Project Information'!$N$6,Validation!$B$116:$D$515,3,FALSE)=\"Charleston\",4,5))","v":{"$error":"#N/A"}},{"$f":"VLOOKUP(AG6,Validation!$C$13:$G$24,IF(VLOOKUP('Project Information'!$N$6,Validation!$B$116:$D$515,3,FALSE)=\"Charleston\",2,3))","v":{"$error":"#N/A"}},{"$f":"IFERROR(IF(AC6=\"No\",0,H6/1000*(1/IF(OR(D6=\"AC\",D6=\"HP\"),T6,S6)-(1/IF(OR(D6=\"AC\",D6=\"HP\"),Q6,P6)))*AH6),0)","v":0},{"$f":"IFERROR(IF(AB6=\"-\",0,I6/3412*(1/IF(OR(D6=\"AC\",D6=\"PTAC\"),1,U6)-(1/IF(OR(D6=\"AC\",D6=\"PTAC\"),1,R6)))*AI6),0)","v":0},0,0.8,{"$f":"IFERROR(IF(AC6=\"No\",0,H6/1000*((1/S6)-(1/P6))*AM6),0)","v":0},{"$f":"_xlfn.XLOOKUP(C6,Validation!$C$3:$C$9,Validation!$H$3:$H$9)","v":{"$error":"#N/A"}},{"$f":"IFERROR(IF(AC6=\"No\",0,IF(D6=\"HP\",I6/3412*((1/U6)-(1/R6)),H6/1000*((1/S6)-(1/P6))))*AO6,0)","v":0},{"$f":"AL6*$AE6","v":0},{"$f":"IF(AN6*$AE6 < 0, 0, AN6*$AE6)","v":0},{"$f":"IF(AP6*$AE6 < 0, 0, AP6*$AE6)","v":0}]
[null,3,{"$f":"'HVAC Unitary'!D25","v":0},{"$f":"IFERROR(VLOOKUP(C7,Validation!$C$3:$E$9,3,FALSE),\"\")","v":""},{"$f":"IFERROR(VLOOKUP(C7,Validation!$C$3:$F$9,4,FALSE),\"\")","v":""},{"$f":"'HVAC Unitary'!G25","v":0},0,{"$f":"'HVAC Unitary'!H25","v":0},{"$f":"'HVAC Unitary'!I25","v":0},{"$error":"#REF!"},"New",{"$error":"#REF!"},0,0,0,{"$f":"'HVAC Unitary'!J25","v":0},{"$f":"'HVAC Unitary'!K25","v":0},{"$f":"IF(G7>65000,'HVAC Unitary'!L25,'HVAC Unitary'!L25/IF(D7=\"PTHP\",1,3.413))","v":0},"","","","","","","","","","-","No",0,{"$f":"'HVAC Unitary'!M25","v":0},0,{"$f":"'HVAC Unitary'!C25","v":0},{"$f":"VLOOKUP(AG7,Validation!$C$13:$G$24,IF(VLOOKUP('Project Information'!$N$6,Validation!$B$116:$D$515,3,FALSE)=\"Charleston\",4,5))","v":{"$error":"#N/A"}},{"$f":"VLOOKUP(AG7,Validation!$C$13:$G$24,IF(VLOOKUP('Project Information'!$N$6,Validation!$B$116:$D$515,3,FALSE)=\"Charleston\",2,3))","v":{"$error":"#N/A"}},0,0,0,0.8,0,{"$f":"_xlfn.XLOOKUP(C7,Validation!$C$3:$C$9,Validation!$H$3:$H$9)","v":{"$error":"#N/A"}},0,0,0,0]
[null,4,{"$f":"'HVAC Unitary'!D26","v":0},{"$f":"IFERROR(VLOOKUP(C8,Validation!$C$3:$E$9,3,FALSE),\"\")","v":""},{"$f":"IFERROR(VLOOKUP(C8,Validation!$C$3:$F$9,4,FALSE),\"\")","v":""},{"$f":"'HVAC Unitary'!G26","v":0},0,{"$f":"'HVAC Unitary'!H26","v":0},{"$f":"'HVAC Unitary'!I26","v":0},{"$error":"#REF!"},"New",{"$error":"#REF!"},0,0,0,{"$f":"'HVAC Unitary'!J26","v":0},{"$f":"'HVAC Unitary'!K26","v":0},{"$f":"IF(G8>65000,'HVAC Unitary'!L26,'HVAC Unitary'!L26/IF(D8=\"PTHP\",1,3.413))","v":0},"","","","","","","","","","-","No",0,{"$f":"'HVAC Unitary'!M26","v":0},0,{"$f":"'HVAC Unitary'!C26","v":0},{"$f":"VLOOKUP(AG8,Validation!$C$13:$G$24,IF(VLOOKUP('Project Information'!$N$6,Validation!$B$116:$D$515,3,FALSE)=\"Charleston\",4,5))","v":{"$error":"#N/A"}},{"$f":"VLOOKUP(AG8,Validation!$C$13:$G$24,IF(VLOOKUP('Project Information'!$N$6,Validation!$B$116:$D$515,3,FALSE)=\"Charleston\",2,3))","v":{"$error":"#N/A"}},0,0,0,0.8,0,{"$f":"_xlfn.XLOOKUP(C8,Validation!$C$3:$C$9,Validation!$H$3:$H$9)","v":{"$error":"#N/A"}},0,0,0,0]
[null,5,{"$f":"'HVAC Unitary'!D27","v":0},{"$f":"IFERROR(VLOOKUP(C9,Validation!$C$3:$E$9,3,FALSE),\"\")","v":""},{"$f":"IFERROR(VLOOKUP(C9,Validation!$C$3:$F$9,4,FALSE),\"\")","v":""},{"$f":"'HVAC Unitary'!G27","v":0},0,{"$f":"'HVAC Unitary'!H27","v":0},{"$f":"'HVAC Unitary'!I27","v":0},{"$error":"#REF!"},"New",{"$error":"#REF!"},0,0,0,{"$f":"'HVAC Unitary'!J27","v":0},{"$f":"'HVAC Unitary'!K27","v":0},{"$f":"IF(G9>65000,'HVAC Unitary'!L27,'HVAC Unitary'!L27/IF(D9=\"PTHP\",1,3.413))","v":0},"","","","","","","","","",{"$f":"IFERROR(IF(OR(C9=0,F9=0),\"-\",IF(AND(P9>=Y9,Q9>=Z9,R9>=AA9),\"Tier 2\",IF(AND(P9>=V9,Q9>=W9,R9>=X9),\"Tier 1\",\"-\"))),\"-\")","v":"-"},"No",0,{"$f":"'HVAC Unitary'!M27","v":0},0,{"$f":"'HVAC Unitary'!C27","v":0},{"$f":"VLOOKUP(AG9,Validation!$C$13:$G$24,IF(VLOOKUP('Project Information'!$N$6,Validation!$B$116:$D$515,3,FALSE)=\"Charleston\",4,5))","v":{"$error":"#N/A"}},{"$f":"VLOOKUP(AG9,Validation!$C$13:$G$24,IF(VLOOKUP('Project Information'!$N$6,Validation!$B$116:$D$515,3,FALSE)=\"Charleston\",2,3))","v":{"$error":"#N/A"}},0,0,0,0.8,0,{"$f":"_xlfn.XLOOKUP(C9,Validation!$C$3:$C$9,Validation!$H$3:$H$9)","v":{"$error":"#N/A"}},0,0,0,0]
[null,6,{"$f":"'HVAC Unitary'!D28","v":0},{"$f":"IFERROR(VLOOKUP(C10,Validation!$C$3:$E$9,3,FALSE),\"\")","v":""},{"$f":"IFERROR(VLOOKUP(C10,Validation!$C$3:$F$9,4,FALSE),\"\")","v":""},{"$f":"'HVAC Unitary'!G28","v":0},0,{"$f":"'HVAC Unitary'!H28","v":0},{"$f":"'HVAC Unitary'!I28","v":0},{"$error":"#REF!"},"New",{"$error":"#REF!"},0,0,0,{"$f":"'HVAC Unitary'!J28","v":0},{"$f":"'HVAC Unitary'!K28","v":0},{"$f":"IF(G10>65000,'HVAC Unitary'!L28,'HVAC Unitary'!L28/IF(D10=\"PTHP\",1,3.413))","v":0},"","","","","","","","","",{"$f":"IFERROR(IF(OR(C10=0,F10=0),\"-\",IF(AND(P10>=Y10,Q10>=Z10,R10>=AA10),\"Tier 2\",IF(AND(P10>=V10,Q10>=W10,R10>=X10),\"Tier 1\",\"-\"))),\"-\")","v":"-"},"No",0,{"$f":"'HVAC Unitary'!M28","v":0},0,{"$f":"'HVAC Unitary'!C28","v":0},{"$f":"VLOOKUP(AG10,Validation!$C$13:$G$24,IF(VLOOKUP('Project Information'!$N$6,Validation!$B$116:$D$515,3,FALSE)=\"Charleston\",4,5))","v":{"$error":"#N/A"}},{"$f":"VLOOKUP(AG10,Validation!$C$13:$G$24,IF(VLOOKUP('Project Information'!$N$6,Validation!$B$116:$D$515,3,FALSE)=\"Charleston\",2,3))","v":{"$error":"#N/A"}},0,0,0,0.8,0,{"$f":"_xlfn.XLOOKUP(C10,Validation!$C$3:$C$9,Validation!$H$3:$H$9)","v":{"$error":"#N/A"}},0,0,0,0]
[null,7,{"$f":"'HVAC Unitary'!D29","v":0},{"$f":"IFERROR(VLOOKUP(C11,Validation!$C$3:$E$9,3,FALSE),\"\")","v":""},{"$f":"IFERROR(VLOOKUP(C11,Validation!$C$3:$F$9,4,FALSE),\"\")","v":""},{"$f":"'HVAC Unitary'!G29","v":0},0,{"$f":"'HVAC Unitary'!H29","v":0},{"$f":"'HVAC Unitary'!I29","v":0},{"$error":"#REF!"},"New",{"$error":"#REF!"},0,0,0,{"$f":"'HVAC Unitary'!J29","v":0},{"$f":"'HVAC Unitary'!K29","v":0},{"$f":"IF(G11>65000,'HVAC Unitary'!L29,'HVAC Unitary'!L29/IF(D11=\"PTHP\",1,3.413))","v":0},"","","","","","","","","","-","No",0,{"$f":"'HVAC Unitary'!M29","v":0},0,{"$f":"'HVAC Unitary'!C29","v":0},{"$f":"VLOOKUP(AG11,Validation!$C$13:$G$24,IF(VLOOKUP('Project Information'!$N$6,Validation!$B$116:$D$515,3,FALSE)=\"Charleston\",4,5))","v":{"$error":"#N/A"}},{"$f":"VLOOKUP(AG11,Validation!$C$13:$G$24,IF(VLOOKUP('Project Information'!$N$6,Validation!$B$116:$D$515,3,FALSE)=\"Charleston\",2,3))","v":{"$error":"#N/A"}},0,0,0,0.8,0,{"$f":"_xlfn.XLOOKUP(C11,Validation!$C$3:$C$9,Validation!$H$3:$H$9)","v":{"$error":"#N/A"}},0,0,0,0]
[null,8,{"$f":"'HVAC Unitary'!D30","v":0},{"$f":"IFERROR(VLOOKUP(C12,Validation!$C$3:$E$9,3,FALSE),\"\")","v":""},{"$f":"IFERROR(VLOOKUP(C12,Validation!$C$3:$F$9,4,FALSE),\"\")","v":""},{"$f":"'HVAC Unitary'!G30","v":0},0,{"$f":"'HVAC Unitary'!H30","v":0},{"$f":"'HVAC Unitary'!I30","v":0},{"$error":"#REF!"},"New",{"$error":"#REF!"},0,0,0,{"$f":"'HVAC Unitary'!J30","v":0},{"$f":"'HVAC Unitary'!K30","v":0},{"$f":"IF(G12>65000,'HVAC Unitary'!L30,'HVAC Unitary'!L30/IF(D12=\"PTHP\",1,3.413))","v":0},"","","","","","","","","","-","No",0,{"$f":"'HVAC Unitary'!M30","v":0},0,{"$f":"'HVAC Unitary'!C30","v":0},{"$f":"VLOOKUP(AG12,Validation!$C$13:$G$24,IF(VLOOKUP('Project Information'!$N$6,Validation!$B$116:$D$515,3,FALSE)=\"Charleston\",4,5))","v":{"$error":"#N/A"}},{"$f":"VLOOKUP(AG12,Validation!$C$13:$G$24,IF(VLOOKUP('Project Information'!$N$6,Validation!$B$116:$D$515,3,FALSE)=\"Charleston\",2,3))","v":{"$error":"#N/A"}},0,0,0,0.8,0,{"$f":"_xlfn.XLOOKUP(C12,Validation!$C$3:$C$9,Validation!$H$3:$H$9)","v":{"$error":"#N/A"}},0,0,0,0]
[null,9,{"$f":"'HVAC Unitary'!D31","v":0},{"$f":"IFERROR(VLOOKUP(C13,Validation!$C$3:$E$9,3,FALSE),\"\")","v":""},{"$f":"IFERROR(VLOOKUP(C13,Validation!$C$3:$F$9,4,FALSE),\"\")","v":""},{"$f":"'HVAC Unitary'!G31","v":0},0,{"$f":"'HVAC Unitary'!H31","v":0},{"$f":"'HVAC Unitary'!I31","v":0},{"$error":"#REF!"},"New",{"$error":"#REF!"},0,0,0,{"$f":"'HVAC Unitary'!J31","v":0},{"$f":"'HVAC Unitary'!K31","v":0},{"$f":"IF(G13>65000,'HVAC Unitary'!L31,'HVAC Unitary'!L31/IF(D13=\"PTHP\",1,3.413))","v":0},{"$f":"IF(D13=\"\",\"\",IF(D13=\"PTAC\",VLOOKUP(G13,PTACBaseline,3)+VLOOKUP(G13,PTACBaseline,4)*G13/1000,IF(D13=\"PTHP\",VLOOKUP(G13,PTHPBaseline,3)+VLOOKUP(G13,PTHPBaseline,4)*G13/1000,0)))","v":""},"","","","","","","","","-","No",0,{"$f":"'HVAC Unitary'!M31","v":0},0,{"$f":"'HVAC Unitary'!C31","v":0},{"$f":"VLOOKUP(AG13,Validation!$C$13:$G$24,IF(VLOOKUP('Project Information'!$N$6,Validation!$B$116:$D$515,3,FALSE)=\"Charleston\",4,5))","v":{"$error":"#N/A"}},{"$f":"VLOOKUP(AG13,Validation!$C$13:$G$24,IF(VLOOKUP('Project Information'!$N$6,Validation!$B$116:$D$515,3,FALSE)=\"Charleston\",2,3))","v":{"$error":"#N/A"}},0,0,0,0.8,0,{"$f":"_xlfn.XLOOKUP(C13,Validation!$C$3:$C$9,Validation!$H$3:$H$9)","v":{"$error":"#N/A"}},0,0,0,0]
[null,10,{"$f":"'HVAC Unitary'!D32","v":0},{"$f":"IFERROR(VLOOKUP(C14,Validation!$C$3:$E$9,3,FALSE),\"\")","v":""},{"$f":"IFERROR(VLOOKUP(C14,Validation!$C$3:$F$9,4,FALSE),\"\")","v":""},{"$f":"'HVAC Unitary'!G32","v":0},0,{"$f":"'HVAC Unitary'!H32","v":0},{"$f":"'HVAC Unitary'!I32","v":0},{"$error":"#REF!"},"New",{"$error":"#REF!"},0,0,0,{"$f":"'HVAC Unitary'!J32","v":0},{"$f":"'HVAC Unitary'!K32","v":0},{"$f":"IF(G14>65000,'HVAC Unitary'!L32,'HVAC Unitary'!L32/IF(D14=\"PTHP\",1,3.413))","v":0},{"$f":"IF(D14=\"\",\"\",IF(D14=\"PTAC\",VLOOKUP(G14,PTACBaseline,3)+VLOOKUP(G14,PTACBaseline,4)*G14/1000,IF(D14=\"PTHP\",VLOOKUP(G14,PTHPBaseline,3)+VLOOKUP(G14,PTHPBaseline,4)*G14/1000,0)))","v":""},"","","","","","","","","-","No",0,{"$f":"'HVAC Unitary'!M32","v":0},0,{"$f":"'HVAC Unitary'!C32","v":0},{"$f":"VLOOKUP(AG14,Validation!$C$13:$G$24,IF(VLOOKUP('Project Information'!$N$6,Validation!$B$116:$D$515,3,FALSE)=\"Charleston\",4,5))","v":{"$error":"#N/A"}},{"$f":"VLOOKUP(AG14,Validation!$C$13:$G$24,IF(VLOOKUP('Project Information'!$N$6,Validation!$B$116:$D$515,3,FALSE)=\"Charleston\",2,3))","v":{"$error":"#N/A"}},0,0,0,0.8,0,{"$f":"_xlfn.XLOOKUP(C14,Validation!$C$3:$C$9,Validation!$H$3:$H$9)","v":{"$error":"#N/A"}},0,0,0,0]
[]
[]
[]
[]
[]
[null,"Baseline Lookup Column Refernces for AC/HP "]
[null,null,null,null,null,null,"Lookup Column Value"]
[null,"Btu/h","System Type","S/P","Rating","Concat","Full Load","Part Load","Heating"]
[null,0,"AC","S","Old",{"$f":"_xlfn.CONCAT(C23,B23,D23,E23)","v":"AC0SOld"},9,12]
[null,45000,"AC","S","Old",{"$f":"_xlfn.CONCAT(C24,B24,D24,E24)","v":"AC45000SOld"},9,12]
[null,65000,"AC","S","Old","AC65000SOld",4,7]
[null,135000,"AC","S","Old","AC135000SOld",4,7]
[null,240000,"AC","S","Old","AC240000SOld",4,7]
[null,760000,"AC","S","Old","AC760000SOld",4,7]
[null,0,"AC","P","Old","AC0POld",10,13]
[null,45000,"AC","P","Old","AC45000POld",10,13]
[null,65000,"AC","P","Old","AC65000POld",4,7]
[null,135000,"AC","P","Old","AC135000POld",4,7]
[null,240000,"AC","P","Old","AC240000POld",4,7]
[null,760000,"AC","P","Old","AC760000POld",4,7]
[null,0,"AC","S","New",{"$f":"_xlfn.CONCAT(C35,B35,D35,E35)","v":"AC0SNew"},3,6]
[null,45000,"AC","S","New",{"$f":"_xlfn.CONCAT(C36,B36,D36,E36)","v":"AC45000SNew"},3,6]
[null,65000,"AC","S","New","AC65000SNew",4,7]
[null,135000,"AC","S","New","AC135000SNew",4,7]
[null,240000,"AC","S","New","AC240000SNew",4,7]
[null,760000,"AC","S","New","AC760000SNew",4,7]
[null,0,"AC","P","New","AC0PNew",4,7]
[null,45000,"AC","P","New","AC45000PNew",4,7]
[null,65000,"AC","P","New","AC65000PNew",4,7]
[null,135000,"AC","P","New","AC135000PNew",4,7]
[null,240000,"AC","P","New","AC240000PNew",4,7]
[null,760000,"AC","P","New","AC760000PNew",4,7]
[null,0,"HP","S","Old",{"$f":"_xlfn.CONCAT(C47,B47,D47,E47)","v":"HP0SOld"},12,15,18]
[null,45000,"HP","S","Old",{"$f":"_xlfn.CONCAT(C48,B48,D48,E48)","v":"HP45000SOld"},12,15,18]
[null,65000,"HP","S","Old","HP65000SOld",4,7,10]
[null,135000,"HP","S","Old","HP135000SOld",4,7,10]
[null,240000,"HP","S","Old","HP240000SOld",4,7,10]
[null,760000,"HP","S","Old","HP760000SOld",4,7,10]
[null,0,"HP","P","Old","HP0POld",13,16,19]
[null,45000,"HP","P","Old","HP45000POld",13,16,19]
[null,65000,"HP","P","Old","HP65000POld",4,7,10]
[null,135000,"HP","P","Old","HP135000POld",4,7,10]
[null,240000,"HP","P","Old","HP240000POld",4,7,10]
[null,760000,"HP","P","Old","HP760000POld",4,7,10]
[null,0,"HP","S","New",{"$f":"_xlfn.CONCAT(C59,B59,D59,E59)","v":"HP0SNew"},3,6,9]
[null,45000,"HP","S","New",{"$f":"_xlfn.CONCAT(C60,B60,D60,E60)","v":"HP45000SNew"},3,6,9]
[null,65000,"HP","S","New","HP65000SNew",4,7,10]
[null,135000,"HP","S","New","HP135000SNew",4,7,10]
[null,240000,"HP","S","New","HP240000SNew",4,7,10]
[null,760000,"HP","S","New","HP760000SNew",4,7,10]
[null,0,"HP","P","New","HP0PNew",4,7,10]
[null,45000,"HP","P","New","HP45000PNew",4,7,10]
[null,65000,"HP","P","New","HP65000PNew",4,7,10]
[null,135000,"HP","P","New","HP135000PNew",4,7,10]
[null,240000,"HP","P","New","HP240000PNew",4,7,10]
[null,760000,"HP","P","New","HP760000PNew",4,7,10]

{"sheet":"HVACLookups","index":7,"n_rows":63,"n_cols":69,"rows_kept":63,"cut":false,"hidden":true,"merged":[[35,63,35,65],[35,66,35,68],[35,49,35,50],[35,51,35,53],[35,54,35,56],[35,57,35,59],[35,60,35,62],[26,63,26,65],[26,66,26,68],[4,38,4,39],[58,3,58,5],[58,6,58,8],[48,3,48,5],[48,24,48,25],[58,24,58,25],[35,38,35,40],[35,41,35,43],[35,44,35,45],[14,38,14,39],[26,44,26,45],[4,60,4,62],[26,49,26,50],[26,51,26,53],[26,54,26,56],[26,57,26,59],[26,60,26,62],[4,51,4,53],[4,54,4,56],[4,57,4,59],[14,51,14,53],[14,54,14,56],[14,57,14,59],[14,60,14,62],[14,26,14,28],[14,29,14,31],[14,32,14,34],[14,35,14,37],[4,26,4,28],[4,29,4,31],[4,32,4,34],[4,35,4,37],[4,3,4,5],[4,6,4,8],[4,9,4,11],[58,15,58,16],[58,17,58,18],[48,13,48,14],[48,17,48,18],[4,12,4,14],[26,41,26,43],[26,15,26,17],[26,18,26,20],[26,26,26,28],[26,29,26,31],[26,32,26,34],[26,35,26,37],[58,19,58,20],[58,1,58,2],[58,13,58,14],[48,1,48,2],[26,38,26,40],[26,1,26,2],[26,3,26,5],[26,6,26,8],[26,9,26,11],[26,12,26,14],[35,26,35,28],[35,29,35,31],[35,32,35,34],[35,35,35,37],[58,26,58,27],[58,28,58,29]]}
["P",30000,"Electric",{"$f":"VLOOKUP(B1,B7:I12,IF(AND(B1<65000,A1=\"U\"),4,3))","v":11.7}]
[]
[null,1,2,3,4,5,6,7,8,9,10,11,12,13,14,null,null,null,null,null,null,null,null,null,1,2,3,4,5,6,7,8,9,10,11,12,13,14,15,16,null,null,null,null,null,null,null,null,null,1,2,3,4,5,6,7,8,9,10,11,12,13,14]
[null,"Air Conditioning - Unitary and Split System baseline efficiency*",null,null,null,null,null,null,null,null,null,null,null,null,null,null,null,null,null,null,null,null,null,null,"Minimum Efficiencies For Incentives - AC Units (Tier 1)",null,null,null,null,null,null,null,null,null,null,null,null,null,null,null,null,null,null,null,null,null,null,null,null,"Air Conditioning - Baseline Checks Tier 1"]
[null,null,null,"EER2/EER - Full Load",null,null,"SEER2/IEER - Part Load",null,null,"EER - Full Load",null,null,"SEER - Part Load",null,null,null,null,null,null,null,null,null,null,null,null,null,"EER2/EER - Full Load",null,null,"SEER2/IEER - Part Load",null,null,"EER - Full Load",null,null,"SEER - Part Load",null,null,"Incentive",null,null,null,null,null,null,null,null,null,null,null,null,"EER2/EER - Full Load",null,null,"SEER2/IEER - Part Load",null,null,"EER - Full Load",null,null,"SEER - Part Load"]
[null,"Btu/h","Tons","S","P","Unit","S","P","Unit","S","P","Unit","S","P","Unit",null,null,null,null,null,null,null,null,null,"Btu/h","Tons","S","P","Unit","S","P","Unit","S","P","Unit","S","P","Unit","Amount","Unit",null,null,null,null,null,null,null,null,null,"Btu/h","Tons","S","P","Unit","S","P","Unit","S","P","Unit","S","P","Unit"]
[null,0,0,11.7,10.6,"EER2",14.3,13.4,"SEER2",{"$f":"D7/0.95","v":12.315789473684211},{"$f":"E7/0.95","v":11.157894736842106},"EER",{"$f":"G7/0.95","v":15.05263157894737},{"$f":"H7/0.95","v":14.105263157894738},"SEER",null,null,null,null,null,null,null,null,null,0,{"$f":"Y7/12000","v":0},null,null,"EER2",15.2,14.3,"SEER2",null,null,"EER",{"$f":"AD7/0.95","v":16},15,"SEER",75,"Ton",null,null,null,null,null,null,null,null,null,0,0,{"$f":"IF(OR(AA7=\"\",$D$7=\"\"),\"\",(AA7/$D$7))","v":""},{"$f":"IF(OR(AB7=\"\",$E$7=\"\"),\"\",(AB7/$E$7))","v":""},"EER2",{"$f":"IF(OR(AD7=\"\",$G$7=\"\"),\"\",(AD7/$G$7))","v":1.0629370629370629},{"$f":"IF(OR(AE7=\"\",$H$7=\"\"),\"\",(AE7/$H$7))","v":1.0671641791044777},"SEER2",{"$f":"IF(OR(AG7=\"\",$J$7=\"\"),\"\",(AG7/$J$7))","v":""},{"$f":"IF(OR(AH7=\"\",$K$7=\"\"),\"\",(AH7/$K$7))","v":""},"EER",{"$f":"IF(OR(AJ7=\"\",$M$7=\"\"),\"\",(AJ7/$M$7))","v":1.0629370629370629},{"$f":"IF(OR(AK7=\"\",$N$7=\"\"),\"\",(AK7/$N$7))","v":1.0634328358208955},"SEER"]
[null,45000,3.75,11.2,10.6,"EER2",13.8,13.4,"SEER2",{"$f":"D8/0.95","v":11.789473684210526},{"$f":"E8/0.95","v":11.157894736842106},"EER",{"$f":"G8/0.95","v":14.526315789473685},{"$f":"H8/0.95","v":14.105263157894738},"SEER",null,null,null,null,null,null,null,null,null,45000,3.75,null,null,"EER2",15.2,14.3,"SEER2",null,null,"EER",{"$f":"AD8/0.95","v":16},15,"SEER",75,"Ton",null,null,null,null,null,null,null,null,null,45000,3.75,{"$f":"IF(OR(AA8=\"\",$D$8=\"\"),\"\",(AA8/$D$8))","v":""},{"$f":"IF(OR(AB8=\"\",$E$8=\"\"),\"\",(AB8/$E$8))","v":""},"EER2",{"$f":"IF(OR(AD8=\"\",$G$8=\"\"),\"\",(AD8/$G$8))","v":1.1014492753623186},{"$f":"IF(OR(AE8=\"\",$H$8=\"\"),\"\",(AE8/$H$8))","v":1.0671641791044777},"SEER2",{"$f":"IF(OR(AG8=\"\",$J$8=\"\"),\"\",(AG8/$J$8))","v":""},{"$f":"IF(OR(AH8=\"\",$K$8=\"\"),\"\",(AH8/$K$8))","v":""},"EER",{"$f":"IF(OR(AJ8=\"\",$M$8=\"\"),\"\",(AJ8/$M$8))","v":1.1014492753623188},{"$f":"IF(OR(AK8=\"\",$N$8=\"\"),\"\",(AK8/$N$8))","v":1.0634328358208955},"SEER"]
[null,65000,{"$f":"B9/12000","v":5.416666666666667},null,11,"EER",null,14.6,"IEER",null,null,"EER",null,null,"IEER",null,null,null,null,null,null,null,null,null,65000,5.416666666666667,null,null,"EER",null,15.3,"IEER",null,null,null,null,null,null,60,"Ton",null,null,null,null,null,null,null,null,null,65000,{"$f":"AX9/12000","v":5.416666666666667},{"$f":"IF(OR(AA9=\"\",$D$9=\"\"),\"\",(AA9/$D$9))","v":""},{"$f":"IF(OR(AB9=\"\",$E$9=\"\"),\"\",(AB9/$E$9))","v":""},"EER",{"$f":"IF(OR(AD9=\"\",$G$9=\"\"),\"\",(AD9/$G$9))","v":""},{"$f":"IF(OR(AE9=\"\",$H$9=\"\"),\"\",(AE9/$H$9))","v":1.047945205479452},"IEER",{"$f":"IF(OR(AG9=\"\",$J$9=\"\"),\"\",(AG9/$J$9))","v":""},{"$f":"IF(OR(AH9=\"\",$K$9=\"\"),\"\",(AH9/$K$9))","v":""},"EER",{"$f":"IF(OR(AJ9=\"\",$M$9=\"\"),\"\",(AJ9/$M$9))","v":""},{"$f":"IF(OR(AK9=\"\",$N$9=\"\"),\"\",(AK9/$N$9))","v":""},"IEER"]
[null,135000,11.25,null,10.8,"EER",null,14,"IEER",null,null,"EER",null,null,"IEER",null,null,null,null,null,null,null,null,null,135000,11.25,null,null,"EER",null,14.7,"IEER",null,null,null,null,null,null,50,"Ton",null,null,null,null,null,null,null,null,null,135000,11.25,{"$f":"IF(OR(AA10=\"\",$D$10=\"\"),\"\",(AA10/$D$10))","v":""},{"$f":"IF(OR(AB10=\"\",$E$10=\"\"),\"\",(AB10/$E$10))","v":""},"EER",{"$f":"IF(OR(AD10=\"\",$G$10=\"\"),\"\",(AD10/$G$10))","v":""},{"$f":"IF(OR(AE10=\"\",$H$10=\"\"),\"\",(AE10/$H$10))","v":1.05},"IEER",{"$f":"IF(OR(AG10=\"\",$J$10=\"\"),\"\",(AG10/$J$10))","v":""},{"$f":"IF(OR(AH10=\"\",$K$10=\"\"),\"\",(AH10/$K$10))","v":""},"EER",{"$f":"IF(OR(AJ10=\"\",$M$10=\"\"),\"\",(AJ10/$M$10))","v":""},{"$f":"IF(OR(AK10=\"\",$N$10=\"\"),\"\",(AK10/$N$10))","v":""},"IEER"]
[null,240000,20,null,9.8000000000000007,"EER",null,13,"IEER",null,null,"EER",null,null,"IEER",null,null,null,null,null,null,null,null,null,240000,20,null,null,"EER",null,13.6,"IEER",null,null,null,null,null,null,40,"Ton",null,null,null,null,null,null,null,null,null,240000,20,{"$f":"IF(OR(AA11=\"\",$D$11=\"\"),\"\",(AA11/$D$11))","v":""},{"$f":"IF(OR(AB11=\"\",$E$11=\"\"),\"\",(AB11/$E$11))","v":""},"EER",{"$f":"IF(OR(AD11=\"\",$G$11=\"\"),\"\",(AD11/$G$11))","v":""},{"$f":"IF(OR(AE11=\"\",$H$11=\"\"),\"\",(AE11/$H$11))","v":1.0461538461538462},"IEER",{"$f":"IF(OR(AG11=\"\",$J$11=\"\"),\"\",(AG11/$J$11))","v":""},{"$f":"IF(OR(AH11=\"\",$K$11=\"\"),\"\",(AH11/$K$11))","v":""},"EER",{"$f":"IF(OR(AJ11=\"\",$M$11=\"\"),\"\",(AJ11/$M$11))","v":""},{"$f":"IF(OR(AK11=\"\",$N$11=\"\"),\"\",(AK11/$N$11))","v":""},"IEER"]
[null,760000,63.333333333333336,null,9.5,"EER",null,11,"IEER",null,null,"EER",null,null,"IEER",null,null,null,null,null,null,null,null,null,760000,63.333333333333336,null,null,"EER",null,11.6,"IEER",null,null,null,null,null,null,15,"Ton",null,null,null,null,null,null,null,null,null,760000,63.333333333333336,{"$f":"IF(OR(AA12=\"\",$D$12=\"\"),\"\",(AA12/$D$12))","v":""},{"$f":"IF(OR(AB12=\"\",$E$12=\"\"),\"\",(AB12/$E$12))","v":""},"EER",{"$f":"IF(OR(AD12=\"\",$G$12=\"\"),\"\",(AD12/$G$12))","v":""},{"$f":"IF(OR(AE12=\"\",$H$12=\"\"),\"\",(AE12/$H$12))","v":1.0545454545454545},"IEER",{"$f":"IF(OR(AG12=\"\",$J$12=\"\"),\"\",(AG12/$J$12))","v":""},{"$f":"IF(OR(AH12=\"\",$K$12=\"\"),\"\",(AH12/$K$12))","v":""},"EER",{"$f":"IF(OR(AJ12=\"\",$M$12=\"\"),\"\",(AJ12/$M$12))","v":""},{"$f":"IF(OR(AK12=\"\",$N$12=\"\"),\"\",(AK12/$N$12))","v":""},"IEER"]
[]
[null,null,"*Black text from CEAM. Red text from AR TRM v9.2. Blue text is calculated from CEAM conversion factors",null,null,null,null,null,null,null,null,null,null,null,null,null,null,null,null,null,null,null,null,null,"Minimum Efficiencies For Incentives - AC Units (Tier 2)",null,null,null,null,null,null,null,null,null,null,null,null,null,null,null,null,null,null,null,null,null,null,null,null,"Air Conditioning - Baseline Checks Tier 2"]
[null,null,null,null,null,null,null,null,null,null,null,null,null,null,null,null,null,null,null,null,null,null,null,null,null,null,"EER2/EER - Full Load",null,null,"SEER2/IEER - Part Load",null,null,"EER - Full Load",null,null,"SEER - Part Load",null,null,"Incentive",null,null,null,null,null,null,null,null,null,null,null,null,"EER2/EER - Full Load",null,null,"SEER2/IEER - Part Load",null,null,"EER - Full Load",null,null,"SEER - Part Load"]
[null,null,null,null,null,null,null,null,null,null,null,null,null,null,null,null,null,null,null,null,null,null,null,null,"Btu/h","Tons","S","P","Unit","S","P","Unit","S","P","Unit","S","P","Unit","Amount","Unit",null,null,null,null,null,null,null,null,null,"Btu/h","Tons","S","P","Unit","S","P","Unit","S","P","Unit","S","P","Unit"]
[null,null,null,null,null,null,null,null,null,null,null,null,null,null,null,null,null,null,null,null,null,null,null,null,0,{"$f":"Y17/12000","v":0},null,null,"EER2",16.149999999999999,15.2,"SEER2",null,null,"EER",{"$f":"AD17/0.95","v":17},{"$f":"AE17/0.95","v":16},"SEER",100,"Ton",null,null,null,null,null,null,null,null,null,0,0,{"$f":"IF(OR(AA17=\"\",$D$7=\"\"),\"\",(AA17/$D$7))","v":""},{"$f":"IF(OR(AB17=\"\",$E$7=\"\"),\"\",(AB17/$E$7))","v":""},"EER2",{"$f":"IF(OR(AD17=\"\",$G$7=\"\"),\"\",(AD17/$G$7))","v":1.1293706293706292},{"$f":"IF(OR(AE17=\"\",$H$7=\"\"),\"\",(AE17/$H$7))","v":1.1343283582089552},"SEER2",{"$f":"IF(OR(AG17=\"\",$J$7=\"\"),\"\",(AG17/$J$7))","v":""},{"$f":"IF(OR(AH17=\"\",$K$7=\"\"),\"\",(AH17/$K$7))","v":""},"EER",{"$f":"IF(OR(AJ17=\"\",$M$7=\"\"),\"\",(AJ17/$M$7))","v":1.1293706293706292},{"$f":"IF(OR(AK17=\"\",$N$7=\"\"),\"\",(AK17/$N$7))","v":1.1343283582089552},"SEER"]
[null,null,null,null,null,null,null,null,null,null,null,null,null,null,null,null,null,null,null,null,null,null,null,null,45000,{"$f":"Y18/12000","v":3.75},null,null,"EER2",16.149999999999999,15.2,"SEER2",null,null,"EER",{"$f":"AD18/0.95","v":17},{"$f":"AE18/0.95","v":16},"SEER",100,"Ton",null,null,null,null,null,null,null,null,null,45000,3.75,{"$f":"IF(OR(AA18=\"\",$D$8=\"\"),\"\",(AA18/$D$8))","v":""},{"$f":"IF(OR(AB18=\"\",$E$8=\"\"),\"\",(AB18/$E$8))","v":""},"EER2",{"$f":"IF(OR(AD18=\"\",$G$8=\"\"),\"\",(AD18/$G$8))","v":1.1702898550724636},{"$f":"IF(OR(AE18=\"\",$H$8=\"\"),\"\",(AE18/$H$8))","v":1.1343283582089552},"SEER2",{"$f":"IF(OR(AG18=\"\",$J$8=\"\"),\"\",(AG18/$J$8))","v":""},{"$f":"IF(OR(AH18=\"\",$K$8=\"\"),\"\",(AH18/$K$8))","v":""},"EER",{"$f":"IF(OR(AJ18=\"\",$M$8=\"\"),\"\",(AJ18/$M$8))","v":1.1702898550724636},{"$f":"IF(OR(AK18=\"\",$N$8=\"\"),\"\",(AK18/$N$8))","v":1.1343283582089552},"SEER"]
[null,null,null,null,null,null,null,null,null,null,null,null,null,null,null,null,null,null,null,null,null,null,null,null,65000,5.416666666666667,null,null,"EER",null,15.8,"IEER",null,null,null,null,null,null,75,"Ton",null,null,null,null,null,null,null,null,null,65000,{"$f":"AX19/12000","v":5.416666666666667},{"$f":"IF(OR(AA19=\"\",$D$9=\"\"),\"\",(AA19/$D$9))","v":""},{"$f":"IF(OR(AB19=\"\",$E$9=\"\"),\"\",(AB19/$E$9))","v":""},"EER",{"$f":"IF(OR(AD19=\"\",$G$9=\"\"),\"\",(AD19/$G$9))","v":""},{"$f":"IF(OR(AE19=\"\",$H$9=\"\"),\"\",(AE19/$H$9))","v":1.0821917808219179},"IEER",{"$f":"IF(OR(AG19=\"\",$J$9=\"\"),\"\",(AG19/$J$9))","v":""},{"$f":"IF(OR(AH19=\"\",$K$9=\"\"),\"\",(AH19/$K$9))","v":""},"EER",{"$f":"IF(OR(AJ19=\"\",$M$9=\"\"),\"\",(AJ19/$M$9))","v":""},{"$f":"IF(OR(AK19=\"\",$N$9=\"\"),\"\",(AK19/$N$9))","v":""},"IEER"]
[null,null,null,null,null,null,null,null,null,null,null,null,null,null,null,null,null,null,null,null,null,null,null,null,135000,11.25,null,null,"EER",null,15.1,"IEER",null,null,null,null,null,null,70,"Ton",null,null,null,null,null,null,null,null,null,135000,11.25,{"$f":"IF(OR(AA20=\"\",$D$10=\"\"),\"\",(AA20/$D$10))","v":""},{"$f":"IF(OR(AB20=\"\",$E$10=\"\"),\"\",(AB20/$E$10))","v":""},"EER",{"$f":"IF(OR(AD20=\"\",$G$10=\"\"),\"\",(AD20/$G$10))","v":""},{"$f":"IF(OR(AE20=\"\",$H$10=\"\"),\"\",(AE20/$H$10))","v":1.0785714285714285},"IEER",{"$f":"IF(OR(AG20=\"\",$J$10=\"\"),\"\",(AG20/$J$10))","v":""},{"$f":"IF(OR(AH20=\"\",$K$10=\"\"),\"\",(AH20/$K$10))","v":""},"EER",{"$f":"IF(OR(AJ20=\"\",$M$10=\"\"),\"\",(AJ20/$M$10))","v":""},{"$f":"IF(OR(AK20=\"\",$N$10=\"\"),\"\",(AK20/$N$10))","v":""},"IEER"]
[null,null,null,null,null,null,null,null,null,null,null,null,null,null,null,null,null,null,null,null,null,null,null,null,240000,20,null,null,"EER",null,14.1,"IEER",null,null,null,null,null,null,60,"Ton",null,null,null,null,null,null,null,null,null,240000,20,{"$f":"IF(OR(AA21=\"\",$D$11=\"\"),\"\",(AA21/$D$11))","v":""},{"$f":"IF(OR(AB21=\"\",$E$11=\"\"),\"\",(AB21/$E$11))","v":""},"EER",{"$f":"IF(OR(AD21=\"\",$G$11=\"\"),\"\",(AD21/$G$11))","v":""},{"$f":"IF(OR(AE21=\"\",$H$11=\"\"),\"\",(AE21/$H$11))","v":1.0846153846153845},"IEER",{"$f":"IF(OR(AG21=\"\",$J$11=\"\"),\"\",(AG21/$J$11))","v":""},{"$f":"IF(OR(AH21=\"\",$K$11=\"\"),\"\",(AH21/$K$11))","v":""},"EER",{"$f":"IF(OR(AJ21=\"\",$M$11=\"\"),\"\",(AJ21/$M$11))","v":""},{"$f":"IF(OR(AK21=\"\",$N$11=\"\"),\"\",(AK21/$N$11))","v":""},"IEER"]
[null,null,null,null,null,null,null,null,null,null,null,null,null,null,null,null,null,null,null,null,null,null,null,null,760000,63.333333333333336,null,null,"EER",null,12,"IEER",null,null,null,null,null,null,20,"Ton",null,null,null,null,null,null,null,null,null,760000,63.333333333333336,{"$f":"IF(OR(AA22=\"\",$D$12=\"\"),\"\",(AA22/$D$12))","v":""},{"$f":"IF(OR(AB22=\"\",$E$12=\"\"),\"\",(AB22/$E$12))","v":""},"EER",{"$f":"IF(OR(AD22=\"\",$G$12=\"\"),\"\",(AD22/$G$12))","v":""},{"$f":"IF(OR(AE22=\"\",$H$12=\"\"),\"\",(AE22/$H$12))","v":1.0909090909090908},"IEER",{"$f":"IF(OR(AG22=\"\",$J$12=\"\"),\"\",(AG22/$J$12))","v":""},{"$f":"IF(OR(AH22=\"\",$K$12=\"\"),\"\",(AH22/$K$12))","v":""},"EER",{"$f":"IF(OR(AJ22=\"\",$M$12=\"\"),\"\",(AJ22/$M$12))","v":""},{"$f":"IF(OR(AK22=\"\",$N$12=\"\"),\"\",(AK22/$N$12))","v":""},"IEER"]
[]
[]
[null,1,2,3,4,5,6,7,8,9,10,11,12,13,14,15,16,17,18,19,20,null,null,null,1,2,3,4,5,6,7,8,9,10,11,12,13,14,15,16,17,18,19,20,21,22,null,null,null,1,2,3,4,5,6,7,8,9,10,11,12,13,14,15,16,17,18,19,20]
[null,"Heat Pumps - Unitary and Split System baseline efficiency",null,null,null,null,null,null,null,null,null,null,null,null,null,null,null,null,null,null,null,null,null,null,"Minimum Efficiencies For Incentives - HP units - (Tier 1)",null,null,null,null,null,null,null,null,null,null,null,null,null,null,null,null,null,null,null,null,null,null,null,null,"Heat Pumps - Baseline Checks Tier 1"]
[null,null,null,"EER2/EER - Full Load",null,null,"SEER2/IEER - Part Load",null,null,"HSPF2/COP - Heating Eff",null,null,"EER - Full Load",null,null,"SEER - Part Load",null,null,"HSPF as COP - Heating Eff",null,null,"HSPF",null,null,null,null,"EER2/EER - Full Load",null,null,"SEER2/IEER - Part Load",null,null,"HSPF2/COP Heating Eff",null,null,"EER - Full Load",null,null,"SEER - Part Load",null,null,"HSPF as COP - Heating Eff",null,null,"Incentive",null,"HSPF",null,null,null,null,"EER2/EER - Full Load",null,null,"SEER2/IEER - Part Load",null,null,"HSPF2/COP Heating Eff",null,null,"EER - Full Load",null,null,"SEER - Part Load",null,null,"HSPF as COP - Heating Eff"]
[null,"Btu/h","Tons","S","P","Unit","S","P","Unit","S","P","Unit","S","P","Unit","S","P","Unit","S","P","Unit","S","P",null,"Btu/h","Tons","S","P","Unit","S","P","Unit","S","P","Unit","S","P","Unit","S","P","Unit","S","P","Unit","Amount","Unit","S","P",null,"Btu/h","Tons","S","P","Unit","S","P","Unit","S","P","Unit","S","P","Unit","S","P","Unit","S","P","Unit"]
[null,0,{"$f":"B29/12000","v":0},11.7,10.6,"EER2",14.3,13.4,"SEER2",{"$f":"7.5/3.413","v":2.1974802226779961},{"$f":"6.7/3.413","v":1.9630823322590099},"COP",{"$f":"D29/0.95","v":12.315789473684211},{"$f":"E29/0.95","v":11.157894736842106},"EER",{"$f":"G29/0.95","v":15.05263157894737},{"$f":"H29/0.95","v":14.105263157894738},"SEER",{"$f":"J29/0.85","v":2.5852708502094073},{"$f":"K29/0.84","v":2.3370027764988213},"COP",{"$f":"S29*3.413","v":8.8235294117647065},{"$f":"T29*3.413","v":7.9761904761904763},null,0,{"$f":"Y29/12000","v":0},null,null,"EER2",15.2,14.3,"SEER2",{"$f":"7.8/3.413","v":2.2853794315851159},{"$f":"7/3.413","v":2.0509815411661294},"COP",null,null,"EER",{"$f":"AD29/0.95","v":16},15,"SEER",{"$f":"9.1/3.413","v":2.6662760035159683},{"$f":"8.3/3.413","v":2.4318781130969827},"COP",100,"ton",{"$f":"AP29*3.413","v":9.1},{"$f":"AQ29*3.413","v":8.3000000000000007},null,0,{"$f":"AX29/12000","v":0},{"$f":"IF(OR(AA29=\"\",$D$29=\"\"),\"\",(AA29/$D$29))","v":""},{"$f":"IF(OR(AB29=\"\",$E$29=\"\"),\"\",(AB29/$E$29))","v":""},"EER2",{"$f":"IF(OR(AD29=\"\",$G$29=\"\"),\"\",(AD29/$G$29))","v":1.0629370629370629},{"$f":"IF(OR(AE29=\"\",$H$29=\"\"),\"\",(AE29/$H$29))","v":1.0671641791044777},"SEER2",{"$f":"IF(OR(AG29=\"\",$J$29=\"\"),\"\",(AG29/$J$29))","v":1.04},{"$f":"IF(OR(AH29=\"\",$K$29=\"\"),\"\",(AH29/$K$29))","v":1.044776119402985},"COP",{"$f":"IF(OR(AJ29=\"\",$M$29=\"\"),\"\",(AJ29/$M$29))","v":""},{"$f":"IF(OR(AK29=\"\",$N$29=\"\"),\"\",(AK29/$N$29))","v":""},"EER",{"$f":"IF(OR(AM29=\"\",$P$29=\"\"),\"\",(AM29/$P$29))","v":1.0629370629370629},{"$f":"IF(OR(AN29=\"\",$Q$29=\"\"),\"\",(AN29/$Q$29))","v":1.0634328358208955},"SEER",{"$f":"IF(OR(AP29=\"\",$S$29=\"\"),\"\",(AP29/$S$29))","v":1.0313333333333332},{"$f":"IF(OR(AQ29=\"\",$T$29=\"\"),\"\",(AQ29/$T$29))","v":1.0405970149253732},"COP"]
[null,45000,{"$f":"B30/12000","v":3.75},11.7,10.6,"EER2",14.3,13.4,"SEER2",{"$f":"7.5/3.413","v":2.1974802226779961},{"$f":"6.7/3.413","v":1.9630823322590099},"COP",{"$f":"D30/0.95","v":12.315789473684211},{"$f":"E30/0.95","v":11.157894736842106},"EER",{"$f":"G30/0.95","v":15.05263157894737},{"$f":"H30/0.95","v":14.105263157894738},"SEER",{"$f":"J30/0.85","v":2.5852708502094073},{"$f":"K30/0.84","v":2.3370027764988213},"COP",{"$f":"S30*3.413","v":8.8235294117647065},{"$f":"T30*3.413","v":7.9761904761904763},null,45000,{"$f":"Y30/12000","v":3.75},null,null,"EER2",15.2,14.3,"SEER2",{"$f":"7.8/3.413","v":2.2853794315851159},{"$f":"7/3.413","v":2.0509815411661294},"COP",null,null,"EER",{"$f":"AD30/0.95","v":16},15,"SEER",{"$f":"9.1/3.413","v":2.6662760035159683},{"$f":"8.3/3.413","v":2.4318781130969827},"COP",100,"ton",{"$f":"AP30*3.413","v":9.1},{"$f":"AQ30*3.413","v":8.3000000000000007},null,45000,{"$f":"AX30/12000","v":3.75},{"$f":"IF(OR(AA30=\"\",$D$30=\"\"),\"\",(AA30/$D$30))","v":""},{"$f":"IF(OR(AB30=\"\",$E$30=\"\"),\"\",(AB30/$E$30))","v":""},"EER2",{"$f":"IF(OR(AD30=\"\",$G$30=\"\"),\"\",(AD30/$G$30))","v":1.0629370629370629},{"$f":"IF(OR(AE30=\"\",$H$30=\"\"),\"\",(AE30/$H$30))","v":1.0671641791044777},"SEER2",{"$f":"IF(OR(AG30=\"\",$J$30=\"\"),\"\",(AG30/$J$30))","v":1.04},{"$f":"IF(OR(AH30=\"\",$K$30=\"\"),\"\",(AH30/$K$30))","v":1.044776119402985},"COP",{"$f":"IF(OR(AJ30=\"\",$M$30=\"\"),\"\",(AJ30/$M$30))","v":""},{"$f":"IF(OR(AK30=\"\",$N$30=\"\"),\"\",(AK30/$N$30))","v":""},"EER",{"$f":"IF(OR(AM30=\"\",$P$30=\"\"),\"\",(AM30/$P$30))","v":1.0629370629370629},{"$f":"IF(OR(AN30=\"\",$Q$30=\"\"),\"\",(AN30/$Q$30))","v":1.0634328358208955},"SEER",{"$f":"IF(OR(AP30=\"\",$S$30=\"\"),\"\",(AP30/$S$30))","v":1.0313333333333332},{"$f":"IF(OR(AQ30=\"\",$T$30=\"\"),\"\",(AQ30/$T$30))","v":1.0405970149253732},"COP"]
[null,65000,{"$f":"B31/12000","v":5.416666666666667},null,10.8,"EER",null,13.9,"IEER",null,3.4,"COP",null,null,null,null,null,null,null,null,null,null,null,null,65000,5.416666666666667,null,null,"EER",null,15.3,"IEER",null,0,"COP",null,null,"EER",null,null,null,null,null,null,75,"ton",null,null,null,65000,{"$f":"AX31/12000","v":5.416666666666667},{"$f":"IF(OR(AA31=\"\",$D$31=\"\"),\"\",(AA31/$D$31))","v":""},{"$f":"IF(OR(AB31=\"\",$E$31=\"\"),\"\",(AB31/$E$31))","v":""},"EER",{"$f":"IF(OR(AD31=\"\",$G$31=\"\"),\"\",(AD31/$G$31))","v":""},{"$f":"IF(OR(AE31=\"\",$H$31=\"\"),\"\",(AE31/$H$31))","v":1.1007194244604317},"IEER",{"$f":"IF(OR(AG31=\"\",$J$31=\"\"),\"\",(AG31/$J$31))","v":""},{"$f":"IF(OR(AH31=\"\",$K$31=\"\"),\"\",(AH31/$K$31))","v":0},"COP",{"$f":"IF(OR(AJ31=\"\",$M$31=\"\"),\"\",(AJ31/$M$31))","v":""},{"$f":"IF(OR(AK31=\"\",$N$31=\"\"),\"\",(AK31/$N$31))","v":""},null,{"$f":"IF(OR(AM31=\"\",$P$31=\"\"),\"\",(AM31/$P$31))","v":""},{"$f":"IF(OR(AN31=\"\",$Q$31=\"\"),\"\",(AN31/$Q$31))","v":""},null,{"$f":"IF(OR(AP31=\"\",$S$31=\"\"),\"\",(AP31/$S$31))","v":""},{"$f":"IF(OR(AQ31=\"\",$T$31=\"\"),\"\",(AQ31/$T$31))","v":""}]
[null,135000,11.25,null,10.4,"EER",null,13.3,"IEER",null,3.3,"COP",null,null,null,null,null,null,null,null,null,null,null,null,135000,11.25,null,null,"EER",null,14.7,"IEER",null,0,"COP",null,null,"EER",null,null,null,null,null,null,55,"ton",null,null,null,135000,11.25,{"$f":"IF(OR(AA32=\"\",$D$32=\"\"),\"\",(AA32/$D$32))","v":""},{"$f":"IF(OR(AB32=\"\",$E$32=\"\"),\"\",(AB32/$E$32))","v":""},"EER",{"$f":"IF(OR(AD32=\"\",$G$32=\"\"),\"\",(AD32/$G$32))","v":""},{"$f":"IF(OR(AE32=\"\",$H$32=\"\"),\"\",(AE32/$H$32))","v":1.1052631578947367},"IEER",{"$f":"IF(OR(AG32=\"\",$J$32=\"\"),\"\",(AG32/$J$32))","v":""},{"$f":"IF(OR(AH32=\"\",$K$32=\"\"),\"\",(AH32/$K$32))","v":0},"COP",{"$f":"IF(OR(AJ32=\"\",$M$32=\"\"),\"\",(AJ32/$M$32))","v":""},{"$f":"IF(OR(AK32=\"\",$N$32=\"\"),\"\",(AK32/$N$32))","v":""},null,{"$f":"IF(OR(AM32=\"\",$P$32=\"\"),\"\",(AM32/$P$32))","v":""},{"$f":"IF(OR(AN32=\"\",$Q$32=\"\"),\"\",(AN32/$Q$32))","v":""},null,{"$f":"IF(OR(AP32=\"\",$S$32=\"\"),\"\",(AP32/$S$32))","v":""},{"$f":"IF(OR(AQ32=\"\",$T$32=\"\"),\"\",(AQ32/$T$32))","v":""}]
[null,240000,20,null,9.3000000000000007,"EER",null,12.3,"IEER",null,3.2,"COP",null,null,null,null,null,null,null,null,null,null,null,null,240000,20,null,null,"EER",null,13.6,"IEER",null,0,"COP",null,null,"EER",null,null,null,null,null,null,50,"ton",null,null,null,240000,20,{"$f":"IF(OR(AA33=\"\",$D$33=\"\"),\"\",(AA33/$D$33))","v":""},{"$f":"IF(OR(AB33=\"\",$E$33=\"\"),\"\",(AB33/$E$33))","v":""},"EER",{"$f":"IF(OR(AD33=\"\",$G$33=\"\"),\"\",(AD33/$G$33))","v":""},{"$f":"IF(OR(AE33=\"\",$H$33=\"\"),\"\",(AE33/$H$33))","v":1.1056910569105689},"IEER",{"$f":"IF(OR(AG33=\"\",$J$33=\"\"),\"\",(AG33/$J$33))","v":""},{"$f":"IF(OR(AH33=\"\",$K$33=\"\"),\"\",(AH33/$K$33))","v":0},"COP",{"$f":"IF(OR(AJ33=\"\",$M$33=\"\"),\"\",(AJ33/$M$33))","v":""},{"$f":"IF(OR(AK33=\"\",$N$33=\"\"),\"\",(AK33/$N$33))","v":""},null,{"$f":"IF(OR(AM33=\"\",$P$33=\"\"),\"\",(AM33/$P$33))","v":""},{"$f":"IF(OR(AN33=\"\",$Q$33=\"\"),\"\",(AN33/$Q$33))","v":""},null,{"$f":"IF(OR(AP33=\"\",$S$33=\"\"),\"\",(AP33/$S$33))","v":""},{"$f":"IF(OR(AQ33=\"\",$T$33=\"\"),\"\",(AQ33/$T$33))","v":""}]
[]
[null,null,"*Black text from CEAM. Red text from AR TRM v9.2. Blue text is calculated from CEAM conversion factors",null,null,null,null,null,null,null,null,null,null,null,null,null,null,null,null,null,null,null,null,null,"Minimum Efficiencies For Incentives - HP units - (Tier 2)",null,null,null,null,null,null,null,null,null,null,null,null,null,null,null,null,null,null,null,null,null,null,null,null,"Heat Pumps - Baseline Checks Tier 2"]
[null,null,null,null,null,null,null,null,null,null,null,null,null,null,null,null,null,null,null,null,null,null,null,null,null,null,"EER2/EER - Full Load",null,null,"SEER2/IEER - Part Load",null,null,"HSPF2/COP Heating Eff",null,null,"EER - Full Load",null,null,"SEER - Part Load",null,null,"HSPF as COP - Heating Eff",null,null,"Incentive",null,"HSPF",null,null,null,null,"EER2/EER - Full Load",null,null,"SEER2/IEER - Part Load",null,null,"HSPF2/COP Heating Eff",null,null,"EER - Full Load",null,null,"SEER - Part Load",null,null,"HSPF as COP - Heating Eff"]
[null,null,null,null,null,null,null,null,null,null,null,null,null,null,null,null,null,null,null,null,null,null,null,null,"Btu/h","Tons","S","P","Unit","S","P","Unit","S","P","Unit","S","P","Unit","S","P","Unit","S","P","Unit","Amount","Unit","S","P",null,"Btu/h","Tons","S","P","Unit","S","P","Unit","S","P","Unit","S","P","Unit","S","P","Unit","S","P","Unit"]
[null,null,null,null,null,null,null,null,null,null,null,null,null,null,null,null,null,null,null,null,null,null,null,null,0,{"$f":"Y38/12000","v":0},null,null,"EER2",16.149999999999999,15.2,"SEER2",{"$f":"8/3.413","v":2.3439789041898624},{"$f":"7.2/3.413","v":2.1095810137708764},"COP",null,null,"EER",{"$f":"AD38/0.95","v":17},{"$f":"AE38/0.95","v":16},"SEER",{"$f":"9.4/3.413","v":2.7541752124230885},{"$f":"8.5/3.413","v":2.4904775857017287},"COP",125,"ton",{"$f":"AP38*3.413","v":9.4},{"$f":"AQ38*3.413","v":8.5},null,0,{"$f":"AX38/12000","v":0},{"$f":"IF(OR(AA38=\"\",$D$29=\"\"),\"\",(AA38/$D$29))","v":""},{"$f":"IF(OR(AB38=\"\",$E$29=\"\"),\"\",(AB38/$E$29))","v":""},"EER2",{"$f":"IF(OR(AD38=\"\",$G$29=\"\"),\"\",(AD38/$G$29))","v":1.1293706293706292},{"$f":"IF(OR(AE38=\"\",$H$29=\"\"),\"\",(AE38/$H$29))","v":1.1343283582089552},"SEER2",{"$f":"IF(OR(AG38=\"\",$J$29=\"\"),\"\",(AG38/$J$29))","v":1.0666666666666667},{"$f":"IF(OR(AH38=\"\",$K$29=\"\"),\"\",(AH38/$K$29))","v":1.0746268656716418},"COP",{"$f":"IF(OR(AJ38=\"\",$M$29=\"\"),\"\",(AJ38/$M$29))","v":""},{"$f":"IF(OR(AK38=\"\",$N$29=\"\"),\"\",(AK38/$N$29))","v":""},"EER",{"$f":"IF(OR(AM38=\"\",$P$29=\"\"),\"\",(AM38/$P$29))","v":1.1293706293706292},{"$f":"IF(OR(AN38=\"\",$Q$29=\"\"),\"\",(AN38/$Q$29))","v":1.1343283582089552},"SEER",{"$f":"IF(OR(AP38=\"\",$S$29=\"\"),\"\",(AP38/$S$29))","v":1.0653333333333332},{"$f":"IF(OR(AQ38=\"\",$T$29=\"\"),\"\",(AQ38/$T$29))","v":1.0656716417910448},"COP"]
[null,null,null,null,null,null,null,null,null,null,null,null,null,null,null,null,null,null,null,null,null,null,null,null,45000,{"$f":"Y39/12000","v":3.75},null,null,"EER2",16.149999999999999,15.2,"SEER2",{"$f":"8/3.413","v":2.3439789041898624},{"$f":"7.2/3.413","v":2.1095810137708764},"COP",null,null,"EER",{"$f":"AD39/0.95","v":17},{"$f":"AE39/0.95","v":16},"SEER",{"$f":"9.4/3.413","v":2.7541752124230885},{"$f":"8.5/3.413","v":2.4904775857017287},"COP",125,"ton",{"$f":"AP39*3.413","v":9.4},{"$f":"AQ39*3.413","v":8.5},null,45000,{"$f":"AX39/12000","v":3.75},{"$f":"IF(OR(AA39=\"\",$D$30=\"\"),\"\",(AA39/$D$30))","v":""},{"$f":"IF(OR(AB39=\"\",$E$30=\"\"),\"\",(AB39/$E$30))","v":""},"EER2",{"$f":"IF(OR(AD39=\"\",$G$30=\"\"),\"\",(AD39/$G$30))","v":1.1293706293706292},{"$f":"IF(OR(AE39=\"\",$H$30=\"\"),\"\",(AE39/$H$30))","v":1.1343283582089552},"SEER2",{"$f":"IF(OR(AG39=\"\",$J$30=\"\"),\"\",(AG39/$J$30))","v":1.0666666666666667},{"$f":"IF(OR(AH39=\"\",$K$30=\"\"),\"\",(AH39/$K$30))","v":1.0746268656716418},"COP",{"$f":"IF(OR(AJ39=\"\",$M$30=\"\"),\"\",(AJ39/$M$30))","v":""},{"$f":"IF(OR(AK39=\"\",$N$30=\"\"),\"\",(AK39/$N$30))","v":""},"EER",{"$f":"IF(OR(AM39=\"\",$P$30=\"\"),\"\",(AM39/$P$30))","v":1.1293706293706292},{"$f":"IF(OR(AN39=\"\",$Q$30=\"\"),\"\",(AN39/$Q$30))","v":1.1343283582089552},"SEER",{"$f":"IF(OR(AP39=\"\",$S$30=\"\"),\"\",(AP39/$S$30))","v":1.0653333333333332},{"$f":"IF(OR(AQ39=\"\",$T$30=\"\"),\"\",(AQ39/$T$30))","v":1.0656716417910448},"COP"]
[null,null,null,null,null,null,null,null,null,null,null,null,null,null,null,null,null,null,null,null,null,null,null,null,65000,5.416666666666667,null,null,"EER",null,15.8,"IEER",null,0,"COP",null,null,null,null,null,null,null,null,null,100,"ton",null,null,null,65000,{"$f":"AX40/12000","v":5.416666666666667},{"$f":"IF(OR(AA40=\"\",$D$31=\"\"),\"\",(AA40/$D$31))","v":""},{"$f":"IF(OR(AB40=\"\",$E$31=\"\"),\"\",(AB40/$E$31))","v":""},"EER",{"$f":"IF(OR(AD40=\"\",$G$31=\"\"),\"\",(AD40/$G$31))","v":""},{"$f":"IF(OR(AE40=\"\",$H$31=\"\"),\"\",(AE40/$H$31))","v":1.1366906474820144},"IEER",{"$f":"IF(OR(AG40=\"\",$J$31=\"\"),\"\",(AG40/$J$31))","v":""},{"$f":"IF(OR(AH40=\"\",$K$31=\"\"),\"\",(AH40/$K$31))","v":0},"COP",{"$f":"IF(OR(AJ40=\"\",$M$31=\"\"),\"\",(AJ40/$M$31))","v":""},{"$f":"IF(OR(AK40=\"\",$N$31=\"\"),\"\",(AK40/$N$31))","v":""},null,{"$f":"IF(OR(AM40=\"\",$P$31=\"\"),\"\",(AM40/$P$31))","v":""},{"$f":"IF(OR(AN40=\"\",$Q$31=\"\"),\"\",(AN40/$Q$31))","v":""},null,{"$f":"IF(OR(AP40=\"\",$S$31=\"\"),\"\",(AP40/$S$31))","v":""},{"$f":"IF(OR(AQ40=\"\",$T$31=\"\"),\"\",(AQ40/$T$31))","v":""}]
[null,null,null,null,null,null,null,null,null,null,null,null,null,null,null,null,null,null,null,null,null,null,null,null,135000,11.25,null,null,"EER",null,15.1,"IEER",null,0,"COP",null,null,null,null,null,null,null,null,null,80,"ton",null,null,null,135000,11.25,{"$f":"IF(OR(AA41=\"\",$D$32=\"\"),\"\",(AA41/$D$32))","v":""},{"$f":"IF(OR(AB41=\"\",$E$32=\"\"),\"\",(AB41/$E$32))","v":""},"EER",{"$f":"IF(OR(AD41=\"\",$G$32=\"\"),\"\",(AD41/$G$32))","v":""},{"$f":"IF(OR(AE41=\"\",$H$32=\"\"),\"\",(AE41/$H$32))","v":1.1353383458646615},"IEER",{"$f":"IF(OR(AG41=\"\",$J$32=\"\"),\"\",(AG41/$J$32))","v":""},{"$f":"IF(OR(AH41=\"\",$K$32=\"\"),\"\",(AH41/$K$32))","v":0},"COP",{"$f":"IF(OR(AJ41=\"\",$M$32=\"\"),\"\",(AJ41/$M$32))","v":""},{"$f":"IF(OR(AK41=\"\",$N$32=\"\"),\"\",(AK41/$N$32))","v":""},null,{"$f":"IF(OR(AM41=\"\",$P$32=\"\"),\"\",(AM41/$P$32))","v":""},{"$f":"IF(OR(AN41=\"\",$Q$32=\"\"),\"\",(AN41/$Q$32))","v":""},null,{"$f":"IF(OR(AP41=\"\",$S$32=\"\"),\"\",(AP41/$S$32))","v":""},{"$f":"IF(OR(AQ41=\"\",$T$32=\"\"),\"\",(AQ41/$T$32))","v":""}]
[null,null,null,null,null,null,null,null,null,null,null,null,null,null,null,null,null,null,null,null,null,null,null,null,240000,20,null,null,"EER",null,14.1,"IEER",null,0,"COP",null,null,null,null,null,null,null,null,null,75,"ton",null,null,null,240000,20,{"$f":"IF(OR(AA42=\"\",$D$33=\"\"),\"\",(AA42/$D$33))","v":""},{"$f":"IF(OR(AB42=\"\",$E$33=\"\"),\"\",(AB42/$E$33))","v":""},"EER",{"$f":"IF(OR(AD42=\"\",$G$33=\"\"),\"\",(AD42/$G$33))","v":""},{"$f":"IF(OR(AE42=\"\",$H$33=\"\"),\"\",(AE42/$H$33))","v":1.1463414634146341},"IEER",{"$f":"IF(OR(AG42=\"\",$J$33=\"\"),\"\",(AG42/$J$33))","v":""},{"$f":"IF(OR(AH42=\"\",$K$33=\"\"),\"\",(AH42/$K$33))","v":0},"COP",{"$f":"IF(OR(AJ42=\"\",$M$33=\"\"),\"\",(AJ42/$M$33))","v":""},{"$f":"IF(OR(AK42=\"\",$N$33=\"\"),\"\",(AK42/$N$33))","v":""},null,{"$f":"IF(OR(AM42=\"\",$P$33=\"\"),\"\",(AM42/$P$33))","v":""},{"$f":"IF(OR(AN42=\"\",$Q$33=\"\"),\"\",(AN42/$Q$33))","v":""},null,{"$f":"IF(OR(AP42=\"\",$S$33=\"\"),\"\",(AP42/$S$33))","v":""},{"$f":"IF(OR(AQ42=\"\",$T$33=\"\"),\"\",(AQ42/$T$33))","v":""}]
[]
[]
[]
[]
[null,1,2,3,4,5,null,null,null,null,null,null,null,1,2,3,4,5,null,null,null,null,null,null,1,2,3,4]
[null,"PTAC",null,null,null,null,null,null,null,null,null,null,null,"PTAC - Minimum Efficiencies allowed",null,null,null,null,null,null,null,null,null,null,"PTAC - Baseline checks"]
[null,null,null,"Baseline Cooling Efficiency",null,null,null,null,null,null,null,null,null,null,null,"Minimum Cooling Efficiency",null,"Incentive",null,null,null,null,null,null,null,null,"Minimum Cooling Efficiency"]
[null,"Btu/h","Tons","Standard and Non-Standard","Capacity Multiplier","Unit",null,null,null,null,null,null,null,"Btu/h","Tons","Standard and Non-Standard","Unit","Amount","Unit",null,null,null,null,null,"Btu/h","Tons","Standard and Non-Standard","Unit"]
[null,0,{"$f":"B51/12000","v":0},11.9,0,"EER",null,null,null,null,null,null,null,0,{"$f":"N51/12000","v":0},12,"EER",20,"Unit",null,null,null,null,null,0,{"$f":"Y51/12000","v":0},null,"EER"]
[null,7000,{"$f":"B52/12000","v":0.58333333333333337},14,-0.3,"EER",null,null,null,null,null,null,null,9000,{"$f":"N52/12000","v":0.75},11.5,"EER",30,"Unit",null,null,null,null,null,9000,{"$f":"Y52/12000","v":0.75},null,"EER"]
[null,15000,{"$f":"B53/12000","v":1.25},9.5,0,"EER",null,null,null,null,null,null,null,12000,{"$f":"N53/12000","v":1},10.5,"EER",40,"Unit",null,null,null,null,null,12000,{"$f":"Y53/12000","v":1},null,"EER"]
[null," "]
[]
[]
[null,1,2,3,4,5,6,7,8,null,null,null,null,1,2,3,4,5,6,null,null,null,null,null,1,2,3,4,5,6]
[null,"PTHP",null,null,null,null,null,null,null,null,null,null,null,"PTHP - Minimum Efficiencies allowed",null,null,null,null,null,null,null,null,null,null,"PTHP - Minimum Efficiencies allowed"]
[null,null,null,"Baseline Cooling Efficiency",null,null,"Baseline Heating Efficiency",null,null,null,null,null,null,null,null,"Minimum Cooling Efficiency",null,"Minimum Heating Efficiency",null,"Incentive",null,null,null,null,null,null,"Minimum Cooling Efficiency",null,"Minimum Heating Efficiency"]
[null,"Btu/h","Tons","Standard and Non-Standard","Capacity Multiplier","Unit","Standard and Non-Standard","Capacity Multiplier","Unit",null,null,null,null,"Btu/h","Tons","Standard and Non-Standard","Unit","Standard and Non-Standard","Unit","Amount","Unit",null,null,null,"Btu/h","Tons","Standard and Non-Standard","Unit","Standard and Non-Standard","Unit"]
[null,0,{"$f":"B61/12000","v":0},11.9,0,"EER",3.3,0,"COP",null,null,null,null,0,{"$f":"N61/12000","v":0},12,"EER",3.3,"COP",40,"Unit",null,null,null,0,{"$f":"Y61/12000","v":0},null,"EER",null,"COP"]
[null,7000,{"$f":"B62/12000","v":0.58333333333333337},14,-0.3,"EER",3.7,-5.1999999999999998E-2,"COP",null,null,null,null,9000,{"$f":"N62/12000","v":0.75},11.5,"EER",3.2,"COP",50,"Unit",null,null,null,9000,{"$f":"Y62/12000","v":0.75},null,"EER",null,"COP"]
[null,15000,1.25,9.5,0,"EER",2.9,0,"COP",null,null,null,null,12000,{"$f":"N63/12000","v":1},10.3,"EER",3.2,"COP",60,"Unit",null,null,null,12000,{"$f":"Y63/12000","v":1},null,"EER",null,"COP"]

{"sheet":"Window Film","index":8,"n_rows":11,"n_cols":19,"rows_kept":11,"cut":false,"hidden":false,"merged":[[0,0,0,8],[1,0,1,8],[2,0,2,8],[8,0,8,7]]}
["Fill in Blue Cells Only!"]
["WINDOW FILM TECHNICAL REQUIREMENTS AND INCENTIVES"]
["▪  To qualify for an incentive window film must be installed on south, east or west facing windows and cover the entire window. Installation on north facing windows is not eligible.\n▪  Window film must have a maximum Solar Heat Gain Coefficient (SHGC) of 0.24 or less.\n▪  Square feet installed must be entered as a whole number.\n\nBlue cells must be filled in for calculations to determine if eligible for incentive."]
["Building Type","Location/Floor/Suite #","Total Square Feet Installed","Number of Windows","Film Manufacturer & Product Code/Model","SHGC","Incentive Per Sq. Ft.","Window Facing Orientation","Total Incentive",null,null,"Incentive","Window Orientation","kWh/SF","kW/SF","Therms/SF","kWh","kW","Therms"]
[null,null,null,null,null,null,{"$f":"CONCATENATE(\"$\",L5,\"/sq. ft.\")","v":"$1/sq. ft."},null,{"$f":"IF(OR(AND(F5>0,F5<=0.24,A5<>\"\")),C5*1,0)","v":0},null,null,1,"South",{"$f":"IF(I5=0,0,VLOOKUP($A5,'Window Film Lookups'!$C$9:$F$22,2,FALSE))","v":0},{"$f":"IF(I5=0,0,VLOOKUP($A5,'Window Film Lookups'!$C$9:$F$22,4,FALSE))","v":0},{"$f":"IF(I5=0,0,VLOOKUP($A5,'Window Film Lookups'!$C$9:$F$22,3,FALSE))","v":0},{"$f":"N5*$C5","v":0},{"$f":"O5*$C5","v":0},0]
[null,null,null,null,null,null,{"$f":"CONCATENATE(\"$\",L6,\"/sq. ft.\")","v":"$1/sq. ft."},null,{"$f":"IF(OR(AND(F6>0,F6<=0.24,A6<>\"\")),C6*1,0)","v":0},null,null,{"$f":"L5","v":1},"East",{"$f":"IF(I6=0,0,VLOOKUP($A6,'Window Film Lookups'!$C$9:$F$22,2,FALSE))","v":0},{"$f":"IF(I6=0,0,VLOOKUP($A6,'Window Film Lookups'!$C$9:$F$22,4,FALSE))","v":0},{"$f":"IF(I6=0,0,VLOOKUP($A6,'Window Film Lookups'!$C$9:$F$22,3,FALSE))","v":0},{"$f":"N6*$C6","v":0},{"$f":"O6*$C6","v":0},{"$f":"P6*$C6","v":0}]
[null,null,null,null,null,null,"$1/sq. ft.",null,{"$f":"IF(OR(AND(F7>0,F7<=0.24,A7<>\"\")),C7*1,0)","v":0},null,null,{"$f":"L6","v":1},"West",{"$f":"IF(I7=0,0,VLOOKUP($A7,'Window Film Lookups'!$C$9:$F$22,2,FALSE))","v":0},{"$f":"IF(I7=0,0,VLOOKUP($A7,'Window Film Lookups'!$C$9:$F$22,4,FALSE))","v":0},{"$f":"IF(I7=0,0,VLOOKUP($A7,'Window Film Lookups'!$C$9:$F$22,3,FALSE))","v":0},0,0,0]
[null,null,null,null,null,null,"$1/sq. ft.",null,{"$f":"IF(OR(AND(F8>0,F8<=0.24,A8<>\"\")),C8*1,0)","v":0},null,null,1,null,{"$f":"IF(I8=0,0,VLOOKUP($A8,'Window Film Lookups'!$C$9:$F$22,2,FALSE))","v":0},{"$f":"IF(I8=0,0,VLOOKUP($A8,'Window Film Lookups'!$C$9:$F$22,4,FALSE))","v":0},{"$f":"IF(I8=0,0,VLOOKUP($A8,'Window Film Lookups'!$C$9:$F$22,3,FALSE))","v":0},0,0,0]
["Total Requested Incentive",null,null,null,null,null,null,null,{"$f":"SUM(I5:I8)","v":0}]
[]
[null,null,null,null,null,null,null,null,{"$f":"\"Version \"  &  'Version Tracking'!C4","v":"Version 15.2"}]

{"sheet":"Cool Roof","index":9,"n_rows":17,"n_cols":17,"rows_kept":17,"cut":false,"hidden":false,"merged":[[11,13,11,15],[0,0,0,7],[1,0,1,7],[2,0,2,7],[8,0,8,6]]}
["Fill in Blue Cells Only!"]
["COOL ROOF TECHNICAL REQUIREMENTS AND INCENTIVES"]
["▪  Roof coverings must be certified by CRRC (Cool Roof Rating Council).                                                                 \t                                                                                                                                                   \n▪  The roof must have at least an initial rated reflectance of 0.65, and a rated reflectance of 0.50 after 3 years of exposure.                                                                                                                                                         \n▪  The roof covering can’t be ballasted, or otherwise mostly covered with other materials.   \n▪  Roof must be located over an air-conditioned space.\n\nBlue cells must be filled in for calculations to determine if qualifies for an incentive.                       "]
["Building Type","Roofing Brand/Manufacturer & Product Code/ Model","Cool Roof Application","Initial Reflectance","Aged Reflectanace","Roof Area (sq. ft.)","Incentive Per Sq. Ft.","Total Incentive",null,null,"Location","ESF","DSF","kWh","kW","kWh/SF","kW/SF"]
[null,null,null,null,null,null,0.1,{"$f":"IF(OR(D5=\"\",E5=\"\",F5=\"\"),0,IF(OR(K5=$L$16,K5=$L$17),K5,IF(AND(D5>=0.65,E5>=0.5),F5*0.1,0)))","v":0},null,null,{"$f":"IFERROR(IF(A5=\"\",\"\",IF('Project Information'!$N$6=\"\",$L$16,VLOOKUP('Project Information'!$N$6,Validation!$B$115:$D$515,3,FALSE))),$L$17)","v":""},{"$f":"IFERROR(INDEX(Validation!D$52:D$87,MATCH(1,($A5=Validation!$B$52:$B$87)*($K5=Validation!$C$52:$C$87),0)),0)","v":0},{"$f":"IFERROR(INDEX(Validation!E$52:E$87,MATCH(1,($A5=Validation!$B$52:$B$87)*($K5=Validation!$C$52:$C$87),0)),0)","v":0},{"$f":"$F5*L5","v":0},{"$f":"$F5*M5","v":0},{"$f":"IFERROR(N5/F5,0)","v":0},{"$f":"IFERROR(O5/F5,0)","v":0}]
[null,null,null,null,null,null,0.1,{"$f":"IF(OR(D6=\"\",E6=\"\",F6=\"\"),0,IF(OR(K6=$L$16,K6=$L$17),K6,IF(AND(D6>=0.65,E6>=0.5),F6*0.1,0)))","v":0},null,null,{"$f":"IFERROR(IF(A6=\"\",\"\",IF('Project Information'!$N$6=\"\",$L$16,VLOOKUP('Project Information'!$N$6,Validation!$B$115:$D$515,3,FALSE))),$L$17)","v":""},{"$f":"IFERROR(INDEX(Validation!D$52:D$87,MATCH(1,($A6=Validation!$B$52:$B$87)*($K6=Validation!$C$52:$C$87),0)),0)","v":0},{"$f":"IFERROR(INDEX(Validation!E$52:E$87,MATCH(1,($A6=Validation!$B$52:$B$87)*($K6=Validation!$C$52:$C$87),0)),0)","v":0},{"$f":"$F6*L6","v":0},{"$f":"$F6*M6","v":0},{"$f":"IFERROR(N6/F6,0)","v":0},{"$f":"IFERROR(O6/F6,0)","v":0}]
[null,null,null,null,null,null,0.1,0,null,null,{"$f":"IFERROR(IF(A7=\"\",\"\",IF('Project Information'!$N$6=\"\",$L$16,VLOOKUP('Project Information'!$N$6,Validation!$B$115:$D$515,3,FALSE))),$L$17)","v":""},{"$f":"IFERROR(INDEX(Validation!D$52:D$87,MATCH(1,($A7=Validation!$B$52:$B$87)*($K7=Validation!$C$52:$C$87),0)),0)","v":0},{"$f":"IFERROR(INDEX(Validation!E$52:E$87,MATCH(1,($A7=Validation!$B$52:$B$87)*($K7=Validation!$C$52:$C$87),0)),0)","v":0},0,0,0,0]
[null,null,null,null,null,null,0.1,0,null,null,{"$f":"IFERROR(IF(A8=\"\",\"\",IF('Project Information'!$N$6=\"\",$L$16,VLOOKUP('Project Information'!$N$6,Validation!$B$115:$D$515,3,FALSE))),$L$17)","v":""},{"$f":"IFERROR(INDEX(Validation!D$52:D$87,MATCH(1,($A8=Validation!$B$52:$B$87)*($K8=Validation!$C$52:$C$87),0)),0)","v":0},{"$f":"IFERROR(INDEX(Validation!E$52:E$87,MATCH(1,($A8=Validation!$B$52:$B$87)*($K8=Validation!$C$52:$C$87),0)),0)","v":0},0,0,0,0]
["Total Requested Incentive",null,null,null,null,null,null,{"$f":"SUM(H5:H8)","v":0}]
[]
[null,null,null,null,null,null,null,{"$f":"\"Version \"  &  'Version Tracking'!C4","v":"Version 15.2"}]
[null,null,null,null,null,null,null,null,null,null,null,null,null,"Summary Table"]
[null,null,null,null,null,null,null,null,null,null,null,null,null,"Total kWh ","Total Summer Coincident Peak (kW)","Total Incentive"]
[null,null,null,null,null,null,null,null,null,null,null,null,null,{"$f":"SUM(N5:N8)","v":0},{"$f":"SUM(O5:O8)","v":0},{"$f":"H9","v":0}]
[]
[null,null,null,null,null,null,null,null,null,null,"Missing zip code message:","Fill in zip code in cell L6 on Project Information tab"]
[null,null,null,null,null,null,null,null,null,null,"Non-eligible zip code message:","Ineligible zip code. Please check cell L6 on Project Information tab"]

{"sheet":"Window Film Lookups","index":10,"n_rows":22,"n_cols":6,"rows_kept":22,"cut":false,"hidden":true,"merged":[[4,2,7,2]]}
[]
[null,null,"Data Provided from the evaluator"]
[]
[]
[null,null,"BuildingTypeWF","Annual window film savings/sq. ft."]
[null,null,null,"Measure","Measure","Measure Coincident Summer Elec. Peak Differential"]
[null,null,null,"Total Elec. Differential","Total Gas Differential","(kW)"]
[null,null,null,"(kWh)","(Therms)"]
[null,null,"Elementary School",5,0.159,2E-3]
[null,null,"Fast Food",12,-0.379,4.0000000000000001E-3]
[null,null,"Full Restaurant ",11,-0.36699999999999999,4.0000000000000001E-3]
[null,null,"Grocery",2,-0.52,2E-3]
[null,null,"High School",6,4.7E-2,2E-3]
[null,null,"Hospital",35,2.2000000000000002,5.0000000000000001E-3]
[null,null,"Large Hotel",7,8.9999999999999993E-3,2E-3]
[null,null,"Large Office",16,4.5999999999999999E-2,4.0000000000000001E-3]
[null,null,"OutPatient",32,1.1020000000000001,5.0000000000000001E-3]
[null,null,"Retail",10,-0.33500000000000002,4.0000000000000001E-3]
[null,null,"Small Hotel",12,-0.13100000000000001,3.0000000000000001E-3]
[null,null,"Small Office",12,-0.253,4.0000000000000001E-3]
[null,null,"Strip Mall",9,-0.43,4.0000000000000001E-3]
[null,null,"Warehouse",6,-0.32500000000000001,3.0000000000000001E-3]

{"sheet":"HVAC Chillers","index":11,"n_rows":79,"n_cols":26,"rows_kept":79,"cut":false,"hidden":false,"merged":[[55,25,56,25],[57,25,58,25],[59,25,60,25],[61,25,62,25],[63,25,64,25],[65,25,66,25],[67,25,68,25],[31,21,32,21],[45,21,46,21],[47,21,48,21],[49,21,50,21],[51,21,52,21],[53,21,54,21],[55,21,56,21],[57,21,58,21],[59,21,60,21],[65,21,66,21],[67,21,68,21],[53,24,54,24],[45,24,46,24],[31,22,32,22],[31,23,32,23],[31,24,32,24],[45,25,46,25],[47,25,48,25],[49,25,50,25],[51,25,52,25],[53,25,54,25],[13,21,14,21],[15,21,16,21],[17,21,18,21],[19,21,20,21],[21,21,22,21],[23,21,24,21],[25,21,26,21],[27,21,28,21],[29,21,30,21],[27,25,28,25],[29,25,30,25],[31,25,32,25],[25,22,26,22],[25,23,26,23],[25,24,26,24],[27,22,28,22],[27,23,28,23],[27,24,28,24],[29,22,30,22],[29,23,30,23],[9,25,10,25],[11,25,12,25],[13,25,14,25],[15,25,16,25],[17,25,18,25],[19,25,20,25],[21,25,22,25],[23,25,24,25],[25,25,26,25],[74,2,74,3],[75,2,75,3],[76,2,76,3],[65,16,66,16],[65,17,66,17],[65,18,66,18],[65,19,66,19],[65,3,66,3],[67,3,68,3],[72,6,72,7],[73,6,73,7],[74,6,74,7],[75,6,75,7],[65,8,66,8],[65,9,66,9],[65,10,66,10],[65,11,66,11],[65,12,66,12],[65,4,66,4],[65,7,66,7],[73,10,73,11],[74,10,74,11],[75,10,75,11],[76,10,76,11],[65,20,66,20],[65,22,66,22],[65,23,66,23],[65,24,66,24],[67,16,68,16],[67,17,68,17],[67,18,68,18],[67,19,68,19],[67,20,68,20],[67,22,68,22],[67,23,68,23],[67,24,68,24],[61,16,62,16],[61,17,62,17],[61,18,62,18],[61,19,62,19],[61,20,62,20],[61,22,62,22],[61,23,62,23],[61,24,62,24],[63,16,64,16],[63,17,64,17],[63,18,64,18],[63,19,64,19],[63,20,64,20],[63,22,64,22],[63,23,64,23],[63,24,64,24],[61,21,62,21],[63,21,64,21],[57,17,58,17],[57,18,58,18],[57,19,58,19],[57,20,58,20],[57,22,58,22],[57,23,58,23],[57,24,58,24],[59,16,60,16],[59,17,60,17],[59,18,60,18],[59,19,60,19],[59,20,60,20],[59,22,60,22],[59,23,60,23],[59,24,60,24],[57,16,58,16],[55,24,56,24],[49,24,50,24],[51,16,52,16],[51,17,52,17],[51,18,52,18],[51,19,52,19],[51,20,52,20],[51,22,52,22],[51,23,52,23],[51,24,52,24],[53,16,54,16],[53,17,54,17],[53,18,54,18],[53,19,54,19],[53,20,54,20],[53,22,54,22],[53,23,54,23],[47,24,48,24],[63,3,64,3],[61,9,62,9],[61,10,62,10],[61,11,62,11],[61,12,62,12],[47,3,48,3],[49,3,50,3],[51,3,52,3],[53,3,54,3],[55,3,56,3],[57,3,58,3],[59,3,60,3],[61,3,62,3],[47,12,48,12],[49,8,50,8],[49,9,50,9],[55,16,56,16],[55,17,56,17],[55,18,56,18],[55,19,56,19],[55,20,56,20],[55,22,56,22],[55,23,56,23],[45,16,46,16],[45,17,46,17],[45,18,45,19],[45,20,46,20],[45,22,46,22],[45,23,46,23],[49,16,50,16],[49,17,50,17],[49,18,50,18],[49,19,50,19],[49,20,50,20],[49,22,50,22],[49,23,50,23],[47,16,48,16],[47,17,48,17],[47,18,48,18],[47,19,48,19],[47,20,48,20],[47,22,48,22],[47,23,48,23],[44,3,46,3],[57,0,62,0],[57,1,58,1],[57,4,58,4],[57,5,58,6],[57,7,58,7],[57,8,58,8],[57,9,58,9],[57,10,58,10],[45,10,46,10],[45,7,46,7],[51,0,56,0],[55,1,56,1],[55,5,56,6],[55,8,56,8],[55,9,56,9],[55,4,56,4],[55,10,56,10],[61,8,62,8],[59,1,60,1],[59,4,60,4],[59,5,60,6],[59,7,60,7],[59,8,60,8],[29,24,30,24],[19,22,20,22],[19,23,20,23],[19,24,20,24],[21,22,22,22],[21,23,22,23],[21,24,22,24],[23,22,24,22],[23,23,24,23],[23,24,24,24],[13,22,14,22],[13,23,14,23],[13,24,14,24],[15,22,16,22],[15,23,16,23],[15,24,16,24],[17,22,18,22],[17,23,18,23],[17,24,18,24],[27,3,28,3],[21,20,22,20],[23,18,24,18],[23,19,24,19],[23,20,24,20],[25,18,26,18],[25,19,26,19],[25,20,26,20],[17,11,18,11],[19,11,20,11],[19,9,20,9],[17,8,18,8],[36,2,36,3],[37,2,37,3],[29,3,30,3],[31,3,32,3],[23,11,24,11],[23,12,24,12],[25,1,26,1],[25,4,26,4],[25,5,26,6],[25,7,26,7],[25,8,26,8],[25,9,26,9],[25,10,26,10],[25,11,26,11],[25,12,26,12],[27,12,28,12],[29,12,30,12],[31,12,32,12],[27,11,28,11],[29,11,30,11],[31,11,32,11],[29,10,30,10],[23,3,24,3],[25,3,26,3],[13,20,14,20],[15,20,16,20],[17,20,18,20],[19,20,20,20],[27,20,28,20],[29,20,30,20],[31,20,32,20],[21,0,26,0],[21,1,22,1],[21,4,22,4],[21,5,22,6],[21,7,22,7],[21,8,22,8],[21,9,22,9],[21,10,22,10],[21,11,22,11],[21,12,22,12],[23,1,24,1],[23,4,24,4],[23,5,24,6],[23,7,24,7],[23,8,24,8],[23,9,24,9],[23,10,24,10],[13,18,14,18],[15,18,16,18],[17,18,18,18],[19,18,20,18],[27,18,28,18],[29,18,30,18],[31,18,32,18],[11,19,12,19],[13,19,14,19],[15,19,16,19],[17,19,18,19],[19,19,20,19],[27,19,28,19],[29,19,30,19],[31,19,32,19],[21,18,22,18],[21,19,22,19],[13,16,14,16],[15,16,16,16],[17,16,18,16],[19,16,20,16],[27,16,28,16],[29,16,30,16],[31,16,32,16],[11,17,12,17],[13,17,14,17],[15,17,16,17],[17,17,18,17],[19,17,20,17],[27,17,28,17],[29,17,30,17],[31,17,32,17],[21,16,22,16],[21,17,22,17],[23,16,24,16],[23,17,24,17],[25,16,26,16],[25,17,26,17],[9,18,9,19],[9,20,10,20],[9,22,10,22],[9,23,10,23],[9,24,10,24],[11,16,12,16],[11,18,12,18],[11,20,12,20],[11,22,12,22],[11,23,12,23],[11,24,12,24],[9,21,10,21],[11,21,12,21],[9,16,10,16],[9,17,10,17],[13,10,14,10],[35,12,36,12],[33,0,33,12],[34,0,34,12],[35,0,36,0],[35,1,36,1],[35,2,35,5],[35,6,35,9],[29,1,30,1],[31,1,32,1],[35,10,36,11],[19,10,20,10],[15,8,16,8],[15,10,16,10],[27,4,28,4],[29,4,30,4],[31,4,32,4],[27,9,28,9],[29,9,30,9],[31,9,32,9],[29,8,30,8],[31,8,32,8],[15,9,16,9],[17,9,18,9],[45,11,46,11],[45,12,46,12],[44,4,44,7],[15,1,16,1],[15,5,16,6],[13,11,14,11],[13,12,14,12],[15,11,16,11],[76,6,76,7],[67,7,68,7],[37,6,37,7],[39,6,39,7],[38,6,38,7],[40,6,40,7],[42,0,42,12],[43,0,43,12],[44,8,44,12],[45,8,46,8],[44,0,46,0],[13,1,14,1],[13,8,14,8],[13,9,14,9],[17,10,18,10],[19,8,20,8],[11,7,12,7],[13,7,14,7],[15,7,16,7],[17,7,18,7],[19,7,20,7],[27,7,28,7],[29,7,30,7],[31,7,32,7],[36,6,36,7],[13,5,14,6],[19,5,20,6],[17,5,18,6],[29,5,30,6],[31,5,32,6],[0,0,0,12],[1,0,1,12],[5,0,5,12],[8,8,8,12],[6,0,6,12],[7,0,7,12],[2,0,2,12],[3,0,3,12],[9,4,10,4],[8,0,10,0],[8,1,10,1],[8,2,10,2],[9,5,10,6],[4,0,4,12],[8,4,8,7],[9,7,10,7],[9,10,10,10],[9,11,10,11],[9,12,10,12],[8,3,10,3],[11,11,12,11],[11,12,12,12],[9,8,10,8],[9,9,10,9],[31,10,32,10],[27,0,32,0],[27,1,28,1],[27,5,28,6],[27,8,28,8],[27,10,28,10],[15,12,16,12],[17,12,18,12],[19,12,20,12],[11,0,14,0],[11,5,12,6],[11,9,12,9],[17,1,18,1],[11,8,12,8],[11,10,12,10],[19,1,20,1],[15,0,20,0],[17,3,18,3],[19,3,20,3],[21,3,22,3],[11,4,12,4],[13,4,14,4],[11,1,12,1],[11,3,12,3],[13,3,14,3],[15,3,16,3],[15,4,16,4],[17,4,18,4],[19,4,20,4],[37,10,37,11],[40,10,40,11],[38,10,38,11],[39,10,39,11],[47,0,50,0],[47,1,48,1],[47,8,48,8],[47,9,48,9],[47,4,48,4],[49,4,50,4],[47,7,48,7],[49,7,50,7],[44,1,46,1],[44,2,46,2],[45,4,46,4],[45,5,46,6],[45,9,46,9],[47,10,48,10],[47,11,48,11],[38,2,38,3],[39,2,39,3],[40,2,40,3],[49,1,50,1],[49,10,50,10],[49,11,50,11],[49,12,50,12],[47,5,48,6],[49,5,50,6],[51,11,52,11],[51,12,52,12],[53,1,54,1],[53,8,54,8],[53,9,54,9],[53,10,54,10],[53,11,54,11],[53,12,54,12],[51,1,52,1],[51,5,52,6],[51,8,52,8],[51,9,52,9],[51,10,52,10],[51,4,52,4],[53,4,54,4],[53,5,54,6],[51,7,52,7],[53,7,54,7],[55,11,56,11],[55,12,56,12],[63,1,64,1],[63,5,64,6],[63,8,64,8],[63,9,64,9],[63,10,64,10],[63,11,64,11],[63,4,64,4],[55,7,56,7],[63,7,64,7],[59,12,60,12],[61,1,62,1],[61,4,62,4],[61,5,62,6],[61,7,62,7],[57,11,58,11],[57,12,58,12],[59,9,60,9],[59,10,60,10],[59,11,60,11],[73,2,73,3],[67,12,68,12],[69,0,69,12],[70,0,70,12],[71,0,72,0],[71,1,72,1],[71,2,71,5],[71,6,71,9],[71,10,72,11],[71,12,72,12],[67,1,68,1],[67,5,68,6],[67,8,68,8],[67,9,68,9],[67,10,68,10],[67,11,68,11],[63,0,68,0],[67,4,68,4],[63,12,64,12],[65,1,66,1],[65,5,66,6],[72,2,72,3]]}
["Fill in Blue Cells Only!"]
["HVAC CHILLER TECHNICAL REQUIREMENTS"]
["▪  Air and water cooled chilling packages used in a single chiller HVAC are eligible systems.\n▪  If the chiller serves HVAC and non-HVAC loads, the non-HVAC load may not exceed 25 percent of the chiller’s rated capacity.\n▪  Chillers being installed must meet the full load and Integrated Part Load Value (IPLV) efficiency values.\n▪  For chillers that are manufactured with variable frequency devices (VFDs) as part of the chiller package, the VFDs will not be independently eligible for additional incentives.\n▪ Chillers with a VFD controlling the compressor must be applied for using Table 2.\n▪ Water chilling equipment must meet current Air-Conditioning and Refrigeration Institute (ARI) standards 550/590, be UL listed, and use a minimum ozone-depleting refrigerant.\n▪ Chillers purchased and installed for backup or redundant systems are not eligible for incentives."]
[]
["INCENTIVE CALCULATION INSTRUCTIONS"]
["Incentives are available for high-efficiency base units and any incremental part load efficiency improvements. To calculate total incentive, follow these steps:\nStep 1\nIdentify the appropriate table for reviewing the eligibility requirements and calculating the incentive.                                                                                                                                                                                                                                                          Use Table 1 to review the requirements and enter information for single-speed chillers. Use EER for Full Load value for Air Cooled Chillers and kW/Ton for Full Load value of Water Cooled Chillers\nUse Table 2 to review the requirements and enter information for VFD-controlled chillers. Use EER for Full Load value for Air Cooled Chillers and kW/Ton for Full Load value of Water Cooled Chillers\n                    Base Unit Incentive is calculated by the following formula:\n                    Chiller Size (Net Tons) x Base Unit Incentive = Base Total Incentive\n\n                    Performance Incentive is calculated as follows:\n                  ▪ Air Cooled Chillers (Capped at $125/ton for VFD-controlled air cooled chillers)\n                    [(Proposed Equipment Unit Efficiency – Minimum Incentive Efficiency) x 10] x Chiller Size (Net Tons) x Performance Incentive = Performance Total Incentive\n\n                  ▪  Water Cooled Chillers\n                   [(Minimum Incentive Efficiency – Proposed Equipment Unit Efficiency) x 100] x Chiller Size (Net Tons) x Performance Incentive = Performance Total Incentive  \n\nThe efficiency value (EER, IPLV, or kW/ton) that represents the greater difference between the Minimum Incentive Efficiency and the Proposed Equipment Unit Efficiency should be used in calculating the incentive.\n \nStep 2\nComplete Table 1A or Table 2A with the Chiller Plant Operating Parameters. Be sure to insert total estimated plant load (Tons).\n\nBlue Cells must be filled in for calculations to determine if qualifies for an incentive.\n\n\n"]
[]
["TABLE 1: HVAC CHILLER INCENTIVES - SINGLE-SPEED CHILLERS"]
["Type","Unit Size - ARI Net Tons","Minimum Efficiency \n(Full Load and IPLV)","Building Type","Proposed Equipment",null,null,null,"Incentives"]
[null,null,null,null,"Chiller Size (Net Tons)","Full Load",null,"IPLV","Base Unit Incentive per Ton","Base Total Incentive","Performance Incentive per Ton","Performance Total Incentive","Requested Incentive",null,null,null,"Chiller Type","Single Speed or VFD Controlled","Base Unit Efficiency",null,"Comm_Coincidence_Factor_Summer","Comm_Coincidence_Factor_Winter","EFLHC","Total kWh Saved","Total kW Summer Saved","Total kW Winter Saved"]
[null,null,null,null,null,null,null,null,null,null,null,null,null,null,null,null,null,null,"Full Load \n(EER for Air-Cooled)","IPLV"]
["Air Cooled Chiller with Condenser","< 150 tons","≥ 10.2 EER",null,null,null,null,null,20,{"$f":"IF(AND(F12>=10.2,H12>=13.34),E12*I12,0)","v":0},3,{"$f":"IF(OR(AND(J12>0,(F12-10.2)>=(H12-13.34))),(F12-10.2)*10*E12*K12,IF(OR(AND(J12>0,(F12-10.2)<(H12-13.34))),(H12-13.34)*10*E12*K12,0))","v":0},{"$f":"J12+L12","v":0},null,null,null,"ACC","Single Speed",{"$f":"ROUND(IF($R12=\"Single Speed\",INDEX('Program Info Tables'!$P$4:$S$7,IF(ISNA(MATCH($E12,'Program Info Tables'!$O$4:$O$7,1)),1,MATCH($E12,'Program Info Tables'!$O$4:$O$7,1)+1),MATCH($Q12,'Program Info Tables'!$P$3:$S$3,0)),IF($R12=\"VFD Controlled\",INDEX('Program Info Tables'!$P$4:$S$7,IF(ISNA(MATCH($E12,'Program Info Tables'!$O$4:$O$7,1)),1,MATCH($E12,'Program Info Tables'!$O$4:$O$7,1)+1),MATCH($Q12,'Program Info Tables'!$P$3:$S$3,0)),\"\")),3)","v":9.5540000000000003},{"$f":"ROUND(IF($R12=\"Single Speed\",INDEX('Program Info Tables'!$P$11:$S$14,IF(ISNA(MATCH($E12,'Program Info Tables'!$O$4:$O$7,1)),1,MATCH($E12,'Program Info Tables'!$O$4:$O$7,1)+1),MATCH($Q12,'Program Info Tables'!$P$3:$S$3,0)),IF($R12=\"VFD Controlled\",INDEX('Program Info Tables'!$P$11:$S$14,IF(ISNA(MATCH($E12,'Program Info Tables'!$O$4:$O$7,1)),1,MATCH($E12,'Program Info Tables'!$O$4:$O$7,1)+1),MATCH($Q12,'Program Info Tables'!$P$3:$S$3,0)),\"\")),3)","v":10.407999999999999},0.8,0.09,{"$f":"IFERROR(VLOOKUP(D12,Validation!$B$582:$E$594,4,0),\"\")","v":""},{"$f":"IFERROR(IF(Q12=\"ACC\",E12*((12/T12)-(12/H12))*W12,E12*(T12-H12)*W12),\"\")","v":""},{"$f":"IFERROR(IF(Q12=\"ACC\",E12*((12/S12)-(12/F12))*U12,E12*(S12-F12)*U12),\"\")","v":""},{"$f":"IFERROR(IF(Q12=\"ACC\",E12*((12/S12)-(12/F12))*V12,E12*(S12-F12)*V12),\"\")","v":""}]
[null,null,"≥ 13.34 IPLV"]
[null,"≥ 150 tons","≥ 10.2 EER",null,null,null,null,null,20,{"$f":"IF(AND(F14>=10.2,H14>=13.6),E14*I14,0)","v":0},3,{"$f":"IF(OR(AND(J14>0,(F14-10.2)>=(H14-13.6))),(F14-10.2)*10*E14*K14,IF(OR(AND(J14>0,(F14-10.2)<(H14-13.6))),(H14-13.6)*10*E14*K14,0))","v":0},{"$f":"J14+L14","v":0},null,null,null,"ACC","Single Speed",{"$f":"ROUND(IF($R14=\"Single Speed\",INDEX('Program Info Tables'!$P$4:$S$7,IF(ISNA(MATCH($E14,'Program Info Tables'!$O$4:$O$7,1)),1,MATCH($E14,'Program Info Tables'!$O$4:$O$7,1)+1),MATCH($Q14,'Program Info Tables'!$P$3:$S$3,0)),IF($R14=\"VFD Controlled\",INDEX('Program Info Tables'!$P$4:$S$7,IF(ISNA(MATCH($E14,'Program Info Tables'!$O$4:$O$7,1)),1,MATCH($E14,'Program Info Tables'!$O$4:$O$7,1)+1),MATCH($Q14,'Program Info Tables'!$P$3:$S$3,0)),\"\")),3)","v":9.5540000000000003},{"$f":"ROUND(IF($R14=\"Single Speed\",INDEX('Program Info Tables'!$P$11:$S$14,IF(ISNA(MATCH($E14,'Program Info Tables'!$O$4:$O$7,1)),1,MATCH($E14,'Program Info Tables'!$O$4:$O$7,1)+1),MATCH($Q14,'Program Info Tables'!$P$3:$S$3,0)),IF($R14=\"VFD Controlled\",INDEX('Program Info Tables'!$P$11:$S$14,IF(ISNA(MATCH($E14,'Program Info Tables'!$O$4:$O$7,1)),1,MATCH($E14,'Program Info Tables'!$O$4:$O$7,1)+1),MATCH($Q14,'Program Info Tables'!$P$3:$S$3,0)),\"\")),3)","v":10.407999999999999},0.8,0.09,{"$f":"IFERROR(VLOOKUP(D14,Validation!$B$582:$E$594,4,0),\"\")","v":""},{"$f":"IFERROR(IF(Q14=\"ACC\",E14*((12/T14)-(12/H14))*W14,E14*(T14-H14)*W14),\"\")","v":""},{"$f":"IFERROR(IF(Q14=\"ACC\",E14*((12/S14)-(12/F14))*U14,E14*(S14-F14)*U14),\"\")","v":""},0]
[null,null,"≥ 13.6 IPLV"]
["Water Cooled Screw  Chillers","< 150 tons","≤ 0.71 kW/ton",null,null,null,null,null,35,{"$f":"IF(OR(AND(F16<=0.71,F16>0,H16<=0.56,H16>0)),E16*I16,0)","v":0},4,{"$f":"IF(OR(AND(J16>0,(0.71-F16)>=(0.56-H16))),(0.71-F16)*100*E16*K16,IF(OR(AND(J16>0,(0.71-F16)<(0.56-H16))),(0.56-H16)*100*E16*K16,0))","v":0},{"$f":"J16+L16","v":0},null,null,null,"WCSC","Single Speed",{"$f":"ROUND(IF($R16=\"Single Speed\",INDEX('Program Info Tables'!$P$4:$S$7,IF(ISNA(MATCH($E16,'Program Info Tables'!$O$4:$O$7,1)),1,MATCH($E16,'Program Info Tables'!$O$4:$O$7,1)+1),MATCH($Q16,'Program Info Tables'!$P$3:$S$3,0)),IF($R16=\"VFD Controlled\",INDEX('Program Info Tables'!$P$4:$S$7,IF(ISNA(MATCH($E16,'Program Info Tables'!$O$4:$O$7,1)),1,MATCH($E16,'Program Info Tables'!$O$4:$O$7,1)+1),MATCH($Q16,'Program Info Tables'!$P$3:$S$3,0)),\"\")),3)","v":0.79},{"$f":"ROUND(IF($R16=\"Single Speed\",INDEX('Program Info Tables'!$P$11:$S$14,IF(ISNA(MATCH($E16,'Program Info Tables'!$O$4:$O$7,1)),1,MATCH($E16,'Program Info Tables'!$O$4:$O$7,1)+1),MATCH($Q16,'Program Info Tables'!$P$3:$S$3,0)),IF($R16=\"VFD Controlled\",INDEX('Program Info Tables'!$P$11:$S$14,IF(ISNA(MATCH($E16,'Program Info Tables'!$O$4:$O$7,1)),1,MATCH($E16,'Program Info Tables'!$O$4:$O$7,1)+1),MATCH($Q16,'Program Info Tables'!$P$3:$S$3,0)),\"\")),3)","v":0.67600000000000005},0.8,0.09,{"$f":"IFERROR(VLOOKUP(D16,Validation!$B$582:$E$594,4,0),\"\")","v":""},{"$f":"IFERROR(IF(Q16=\"ACC\",E16*((12/T16)-(12/H16))*W16,E16*(T16-H16)*W16),\"\")","v":""},{"$f":"IFERROR(IF(Q16=\"ACC\",E16*((12/S16)-(12/F16))*U16,E16*(S16-F16)*U16),\"\")","v":0},0]
[null,null,"≤ 0.56 IPLV"]
[null,"≥ 150 tons and \n< 300 tons","≤ 0.58 kW//ton",null,null,null,null,null,35,{"$f":"IF(OR(AND(F18<=0.58,F18>0,H18<=0.47,H18>0)),E18*I18,0)","v":0},3,{"$f":"IF(OR(AND(J18>0,(0.58-F18)>=(0.47-H18))),(0.58-F18)*100*E18*K18,IF(OR(AND(J18>0,(0.58-F18)<(0.47-H18))),(0.47-H18)*100*E18*K18,0))","v":0},{"$f":"J18+L18","v":0},null,null,null,"WCSC","Single Speed",{"$f":"ROUND(IF($R18=\"Single Speed\",INDEX('Program Info Tables'!$P$4:$S$7,IF(ISNA(MATCH($E18,'Program Info Tables'!$O$4:$O$7,1)),1,MATCH($E18,'Program Info Tables'!$O$4:$O$7,1)+1),MATCH($Q18,'Program Info Tables'!$P$3:$S$3,0)),IF($R18=\"VFD Controlled\",INDEX('Program Info Tables'!$P$4:$S$7,IF(ISNA(MATCH($E18,'Program Info Tables'!$O$4:$O$7,1)),1,MATCH($E18,'Program Info Tables'!$O$4:$O$7,1)+1),MATCH($Q18,'Program Info Tables'!$P$3:$S$3,0)),\"\")),3)","v":0.79},{"$f":"ROUND(IF($R18=\"Single Speed\",INDEX('Program Info Tables'!$P$11:$S$14,IF(ISNA(MATCH($E18,'Program Info Tables'!$O$4:$O$7,1)),1,MATCH($E18,'Program Info Tables'!$O$4:$O$7,1)+1),MATCH($Q18,'Program Info Tables'!$P$3:$S$3,0)),IF($R18=\"VFD Controlled\",INDEX('Program Info Tables'!$P$11:$S$14,IF(ISNA(MATCH($E18,'Program Info Tables'!$O$4:$O$7,1)),1,MATCH($E18,'Program Info Tables'!$O$4:$O$7,1)+1),MATCH($Q18,'Program Info Tables'!$P$3:$S$3,0)),\"\")),3)","v":0.67600000000000005},0.8,0.09,{"$f":"IFERROR(VLOOKUP(D18,Validation!$B$582:$E$594,4,0),\"\")","v":""},{"$f":"IFERROR(IF(Q18=\"ACC\",E18*((12/T18)-(12/H18))*W18,E18*(T18-H18)*W18),\"\")","v":""},{"$f":"IFERROR(IF(Q18=\"ACC\",E18*((12/S18)-(12/F18))*U18,E18*(S18-F18)*U18),\"\")","v":0},0]
[null,null,"≤ 0.47 IPLV"]
[null,"≥ 300","≤ 0.56 kW/ton",null,null,null,null,null,25,{"$f":"IF(OR(AND(F20<=0.56,F20>0,H20<=0.45,H20>0)),E20*I20,0)","v":0},2,{"$f":"IF(OR(AND(J20>0,(0.56-F20)>=(0.45-H20))),(0.56-F20)*100*E20*K20,IF(OR(AND(J20>0,(0.56-F20)<(0.45-H20))),(0.45-H20)*100*E20*K20,0))","v":0},{"$f":"J20+L20","v":0},null,null,null,"WCSC","Single Speed",{"$f":"ROUND(IF($R20=\"Single Speed\",INDEX('Program Info Tables'!$P$4:$S$7,IF(ISNA(MATCH($E20,'Program Info Tables'!$O$4:$O$7,1)),1,MATCH($E20,'Program Info Tables'!$O$4:$O$7,1)+1),MATCH($Q20,'Program Info Tables'!$P$3:$S$3,0)),IF($R20=\"VFD Controlled\",INDEX('Program Info Tables'!$P$4:$S$7,IF(ISNA(MATCH($E20,'Program Info Tables'!$O$4:$O$7,1)),1,MATCH($E20,'Program Info Tables'!$O$4:$O$7,1)+1),MATCH($Q20,'Program Info Tables'!$P$3:$S$3,0)),\"\")),3)","v":0.79},{"$f":"ROUND(IF($R20=\"Single Speed\",INDEX('Program Info Tables'!$P$11:$S$14,IF(ISNA(MATCH($E20,'Program Info Tables'!$O$4:$O$7,1)),1,MATCH($E20,'Program Info Tables'!$O$4:$O$7,1)+1),MATCH($Q20,'Program Info Tables'!$P$3:$S$3,0)),IF($R20=\"VFD Controlled\",INDEX('Program Info Tables'!$P$11:$S$14,IF(ISNA(MATCH($E20,'Program Info Tables'!$O$4:$O$7,1)),1,MATCH($E20,'Program Info Tables'!$O$4:$O$7,1)+1),MATCH($Q20,'Program Info Tables'!$P$3:$S$3,0)),\"\")),3)","v":0.67600000000000005},0.8,0.09,{"$f":"IFERROR(VLOOKUP(D20,Validation!$B$582:$E$594,4,0),\"\")","v":""},{"$f":"IFERROR(IF(Q20=\"ACC\",E20*((12/T20)-(12/H20))*W20,E20*(T20-H20)*W20),\"\")","v":""},{"$f":"IFERROR(IF(Q20=\"ACC\",E20*((12/S20)-(12/F20))*U20,E20*(S20-F20)*U20),\"\")","v":0},0]
[null,null,"≤ 0.45 IPLV"]
["Water Cooled Reciprocating Chillers","< 150 tons","≤ 0.71 kW/ton",null,null,null,null,null,35,{"$f":"IF(OR(AND(F22<=0.71,F22>0,H22<=0.56,H22>0)),E22*I22,0)","v":0},4,{"$f":"IF(OR(AND(J22>0,(0.71-F22)>=(0.56-H22))),(0.71-F22)*100*E22*K22,IF(OR(AND(J22>0,(0.71-F22)<(0.56-H22))),(0.56-H22)*100*E22*K22,0))","v":0},{"$f":"J22+L22","v":0},null,null,null,"WCRC","Single Speed",{"$f":"ROUND(IF($R22=\"Single Speed\",INDEX('Program Info Tables'!$P$4:$S$7,IF(ISNA(MATCH($E22,'Program Info Tables'!$O$4:$O$7,1)),1,MATCH($E22,'Program Info Tables'!$O$4:$O$7,1)+1),MATCH($Q22,'Program Info Tables'!$P$3:$S$3,0)),IF($R22=\"VFD Controlled\",INDEX('Program Info Tables'!$P$4:$S$7,IF(ISNA(MATCH($E22,'Program Info Tables'!$O$4:$O$7,1)),1,MATCH($E22,'Program Info Tables'!$O$4:$O$7,1)+1),MATCH($Q22,'Program Info Tables'!$P$3:$S$3,0)),\"\")),3)","v":0.83699999999999997},{"$f":"ROUND(IF($R22=\"Single Speed\",INDEX('Program Info Tables'!$P$11:$S$14,IF(ISNA(MATCH($E22,'Program Info Tables'!$O$4:$O$7,1)),1,MATCH($E22,'Program Info Tables'!$O$4:$O$7,1)+1),MATCH($Q22,'Program Info Tables'!$P$3:$S$3,0)),IF($R22=\"VFD Controlled\",INDEX('Program Info Tables'!$P$11:$S$14,IF(ISNA(MATCH($E22,'Program Info Tables'!$O$4:$O$7,1)),1,MATCH($E22,'Program Info Tables'!$O$4:$O$7,1)+1),MATCH($Q22,'Program Info Tables'!$P$3:$S$3,0)),\"\")),3)","v":0.69599999999999995},1.8,0.09,{"$f":"IFERROR(VLOOKUP(D22,Validation!$B$582:$E$594,4,0),\"\")","v":""},{"$f":"IFERROR(IF(Q22=\"ACC\",E22*((12/T22)-(12/H22))*W22,E22*(T22-H22)*W22),\"\")","v":""},{"$f":"IFERROR(IF(Q22=\"ACC\",E22*((12/S22)-(12/F22))*U22,E22*(S22-F22)*U22),\"\")","v":0},0]
[null,null,"≤ 0.56 IPLV"]
[null,"≥ 150 tons and \n< 300 tons","≤ 0.58 kW//ton",null,null,null,null,null,35,{"$f":"IF(OR(AND(F24<=0.58,F24>0,H24<=0.47,H24>0)),E24*I24,0)","v":0},3,{"$f":"IF(OR(AND(J24>0,(0.58-F24)>=(0.47-H24))),(0.58-F24)*100*E24*K24,IF(OR(AND(J24>0,(0.58-F24)<(0.47-H24))),(0.47-H24)*100*E24*K24,0))","v":0},{"$f":"J24+L24","v":0},null,null,null,"WCRC","Single Speed",{"$f":"ROUND(IF($R24=\"Single Speed\",INDEX('Program Info Tables'!$P$4:$S$7,IF(ISNA(MATCH($E24,'Program Info Tables'!$O$4:$O$7,1)),1,MATCH($E24,'Program Info Tables'!$O$4:$O$7,1)+1),MATCH($Q24,'Program Info Tables'!$P$3:$S$3,0)),IF($R24=\"VFD Controlled\",INDEX('Program Info Tables'!$P$4:$S$7,IF(ISNA(MATCH($E24,'Program Info Tables'!$O$4:$O$7,1)),1,MATCH($E24,'Program Info Tables'!$O$4:$O$7,1)+1),MATCH($Q24,'Program Info Tables'!$P$3:$S$3,0)),\"\")),3)","v":0.83699999999999997},{"$f":"ROUND(IF($R24=\"Single Speed\",INDEX('Program Info Tables'!$P$11:$S$14,IF(ISNA(MATCH($E24,'Program Info Tables'!$O$4:$O$7,1)),1,MATCH($E24,'Program Info Tables'!$O$4:$O$7,1)+1),MATCH($Q24,'Program Info Tables'!$P$3:$S$3,0)),IF($R24=\"VFD Controlled\",INDEX('Program Info Tables'!$P$11:$S$14,IF(ISNA(MATCH($E24,'Program Info Tables'!$O$4:$O$7,1)),1,MATCH($E24,'Program Info Tables'!$O$4:$O$7,1)+1),MATCH($Q24,'Program Info Tables'!$P$3:$S$3,0)),\"\")),3)","v":0.69599999999999995},2.8,0.09,{"$f":"IFERROR(VLOOKUP(D24,Validation!$B$582:$E$594,4,0),\"\")","v":""},{"$f":"IFERROR(IF(Q24=\"ACC\",E24*((12/T24)-(12/H24))*W24,E24*(T24-H24)*W24),\"\")","v":""},{"$f":"IFERROR(IF(Q24=\"ACC\",E24*((12/S24)-(12/F24))*U24,E24*(S24-F24)*U24),\"\")","v":0},0]
[null,null,"≤ 0.47 IPLV"]
[null,"≥ 300","≤ 0.56 kW/ton",null,null,null,null,null,25,{"$f":"IF(OR(AND(F26<=0.56,F26>0,H26<=0.45,H26>0)),E26*I26,0)","v":0},2,{"$f":"IF(OR(AND(J26>0,(0.56-F26)>=(0.45-H26))),(0.56-F26)*100*E26*K26,IF(OR(AND(J26>0,(0.56-F26)<(0.45-H26))),(0.45-H26)*100*E26*K26,0))","v":0},{"$f":"J26+L26","v":0},null,null,null,"WCRC","Single Speed",{"$f":"ROUND(IF($R26=\"Single Speed\",INDEX('Program Info Tables'!$P$4:$S$7,IF(ISNA(MATCH($E26,'Program Info Tables'!$O$4:$O$7,1)),1,MATCH($E26,'Program Info Tables'!$O$4:$O$7,1)+1),MATCH($Q26,'Program Info Tables'!$P$3:$S$3,0)),IF($R26=\"VFD Controlled\",INDEX('Program Info Tables'!$P$4:$S$7,IF(ISNA(MATCH($E26,'Program Info Tables'!$O$4:$O$7,1)),1,MATCH($E26,'Program Info Tables'!$O$4:$O$7,1)+1),MATCH($Q26,'Program Info Tables'!$P$3:$S$3,0)),\"\")),3)","v":0.83699999999999997},{"$f":"ROUND(IF($R26=\"Single Speed\",INDEX('Program Info Tables'!$P$11:$S$14,IF(ISNA(MATCH($E26,'Program Info Tables'!$O$4:$O$7,1)),1,MATCH($E26,'Program Info Tables'!$O$4:$O$7,1)+1),MATCH($Q26,'Program Info Tables'!$P$3:$S$3,0)),IF($R26=\"VFD Controlled\",INDEX('Program Info Tables'!$P$11:$S$14,IF(ISNA(MATCH($E26,'Program Info Tables'!$O$4:$O$7,1)),1,MATCH($E26,'Program Info Tables'!$O$4:$O$7,1)+1),MATCH($Q26,'Program Info Tables'!$P$3:$S$3,0)),\"\")),3)","v":0.69599999999999995},3.8,0.09,{"$f":"IFERROR(VLOOKUP(D26,Validation!$B$582:$E$594,4,0),\"\")","v":""},{"$f":"IFERROR(IF(Q26=\"ACC\",E26*((12/T26)-(12/H26))*W26,E26*(T26-H26)*W26),\"\")","v":""},{"$f":"IFERROR(IF(Q26=\"ACC\",E26*((12/S26)-(12/F26))*U26,E26*(S26-F26)*U26),\"\")","v":0},0]
[null,null,"≤ 0.45 IPLV"]
["Water Cooled Centrifugal Chillers","< 300 tons","≤ 0.59 kW/ton",null,null,null,null,null,20,{"$f":"IF(OR(AND(F28<=0.59,F28>0,H28<=0.56,H28>0)),E28*I28,0)","v":0},3,{"$f":"IF(OR(AND(J28>0,(0.59-F28)>=(0.56-H28))),(0.59-F28)*100*E28*K28,IF(OR(AND(J28>0,(0.59-F28)<(0.56-H28))),(0.56-H28)*100*E28*K28,0))","v":0},{"$f":"J28+L28","v":0},null,null,null,"WCCC","Single Speed",{"$f":"ROUND(IF($R28=\"Single Speed\",INDEX('Program Info Tables'!$P$4:$S$7,IF(ISNA(MATCH($E28,'Program Info Tables'!$O$4:$O$7,1)),1,MATCH($E28,'Program Info Tables'!$O$4:$O$7,1)+1),MATCH($Q28,'Program Info Tables'!$P$3:$S$3,0)),IF($R28=\"VFD Controlled\",INDEX('Program Info Tables'!$P$4:$S$7,IF(ISNA(MATCH($E28,'Program Info Tables'!$O$4:$O$7,1)),1,MATCH($E28,'Program Info Tables'!$O$4:$O$7,1)+1),MATCH($Q28,'Program Info Tables'!$P$3:$S$3,0)),\"\")),3)","v":0.70299999999999996},{"$f":"ROUND(IF($R28=\"Single Speed\",INDEX('Program Info Tables'!$P$11:$S$14,IF(ISNA(MATCH($E28,'Program Info Tables'!$O$4:$O$7,1)),1,MATCH($E28,'Program Info Tables'!$O$4:$O$7,1)+1),MATCH($Q28,'Program Info Tables'!$P$3:$S$3,0)),IF($R28=\"VFD Controlled\",INDEX('Program Info Tables'!$P$11:$S$14,IF(ISNA(MATCH($E28,'Program Info Tables'!$O$4:$O$7,1)),1,MATCH($E28,'Program Info Tables'!$O$4:$O$7,1)+1),MATCH($Q28,'Program Info Tables'!$P$3:$S$3,0)),\"\")),3)","v":0.67},0.8,0.09,{"$f":"IFERROR(VLOOKUP(D28,Validation!$B$582:$E$594,4,0),\"\")","v":""},{"$f":"IFERROR(IF(Q28=\"ACC\",E28*((12/T28)-(12/H28))*W28,E28*(T28-H28)*W28),\"\")","v":""},{"$f":"IFERROR(IF(Q28=\"ACC\",E28*((12/S28)-(12/F28))*U28,E28*(S28-F28)*U28),\"\")","v":0},0]
[null,null,"≤ 0.56 IPLV"]
[null,"≥ 300 and    \n< 600 tons","≤ 0.56 kW/ton",null,null,null,null,null,20,{"$f":"IF(OR(AND(F30<=0.56,F30>0,H30<=0.53,H30>0)),E30*I30,0)","v":0},3,{"$f":"IF(OR(AND(J30>0,(0.56-F30)>=(0.53-H30))),(0.56-F30)*100*E30*K30,IF(OR(AND(J30>0,(0.56-F30)<(0.53-H30))),(0.53-H30)*100*E30*K30,0))","v":0},{"$f":"J30+L30","v":0},null,null,null,"WCCC","Single Speed",{"$f":"ROUND(IF($R30=\"Single Speed\",INDEX('Program Info Tables'!$P$4:$S$7,IF(ISNA(MATCH($E30,'Program Info Tables'!$O$4:$O$7,1)),1,MATCH($E30,'Program Info Tables'!$O$4:$O$7,1)+1),MATCH($Q30,'Program Info Tables'!$P$3:$S$3,0)),IF($R30=\"VFD Controlled\",INDEX('Program Info Tables'!$P$4:$S$7,IF(ISNA(MATCH($E30,'Program Info Tables'!$O$4:$O$7,1)),1,MATCH($E30,'Program Info Tables'!$O$4:$O$7,1)+1),MATCH($Q30,'Program Info Tables'!$P$3:$S$3,0)),\"\")),3)","v":0.70299999999999996},{"$f":"ROUND(IF($R30=\"Single Speed\",INDEX('Program Info Tables'!$P$11:$S$14,IF(ISNA(MATCH($E30,'Program Info Tables'!$O$4:$O$7,1)),1,MATCH($E30,'Program Info Tables'!$O$4:$O$7,1)+1),MATCH($Q30,'Program Info Tables'!$P$3:$S$3,0)),IF($R30=\"VFD Controlled\",INDEX('Program Info Tables'!$P$11:$S$14,IF(ISNA(MATCH($E30,'Program Info Tables'!$O$4:$O$7,1)),1,MATCH($E30,'Program Info Tables'!$O$4:$O$7,1)+1),MATCH($Q30,'Program Info Tables'!$P$3:$S$3,0)),\"\")),3)","v":0.67},0.8,0.09,{"$f":"IFERROR(VLOOKUP(D30,Validation!$B$582:$E$594,4,0),\"\")","v":""},{"$f":"IFERROR(IF(Q30=\"ACC\",E30*((12/T30)-(12/H30))*W30,E30*(T30-H30)*W30),\"\")","v":""},{"$f":"IFERROR(IF(Q30=\"ACC\",E30*((12/S30)-(12/F30))*U30,E30*(S30-F30)*U30),\"\")","v":0},0]
[null,null,"≤ 0.53 IPLV"]
[null,"≥ 600 tons","≤ 0.55 kW/ton",null,null,null,null,null,20,{"$f":"IF(OR(AND(F32<=0.55,F32>0,H32<=0.52,H32>0)),E32*I32,0)","v":0},2,{"$f":"IF(OR(AND(J32>0,(0.55-F32)>=(0.52-H32))),(0.55-F32)*100*E32*K32,IF(OR(AND(J32>0,(0.55-F32)<(0.52-H32))),(0.52-H32)*100*E32*K32,0))","v":0},{"$f":"J32+L32","v":0},null,null,null,"WCCC","Single Speed",{"$f":"ROUND(IF($R32=\"Single Speed\",INDEX('Program Info Tables'!$P$4:$S$7,IF(ISNA(MATCH($E32,'Program Info Tables'!$O$4:$O$7,1)),1,MATCH($E32,'Program Info Tables'!$O$4:$O$7,1)+1),MATCH($Q32,'Program Info Tables'!$P$3:$S$3,0)),IF($R32=\"VFD Controlled\",INDEX('Program Info Tables'!$P$4:$S$7,IF(ISNA(MATCH($E32,'Program Info Tables'!$O$4:$O$7,1)),1,MATCH($E32,'Program Info Tables'!$O$4:$O$7,1)+1),MATCH($Q32,'Program Info Tables'!$P$3:$S$3,0)),\"\")),3)","v":0.70299999999999996},{"$f":"ROUND(IF($R32=\"Single Speed\",INDEX('Program Info Tables'!$P$11:$S$14,IF(ISNA(MATCH($E32,'Program Info Tables'!$O$4:$O$7,1)),1,MATCH($E32,'Program Info Tables'!$O$4:$O$7,1)+1),MATCH($Q32,'Program Info Tables'!$P$3:$S$3,0)),IF($R32=\"VFD Controlled\",INDEX('Program Info Tables'!$P$11:$S$14,IF(ISNA(MATCH($E32,'Program Info Tables'!$O$4:$O$7,1)),1,MATCH($E32,'Program Info Tables'!$O$4:$O$7,1)+1),MATCH($Q32,'Program Info Tables'!$P$3:$S$3,0)),\"\")),3)","v":0.67},0.8,0.09,{"$f":"IFERROR(VLOOKUP(D32,Validation!$B$582:$E$594,4,0),\"\")","v":""},{"$f":"IFERROR(IF(Q32=\"ACC\",E32*((12/T32)-(12/H32))*W32,E32*(T32-H32)*W32),\"\")","v":""},{"$f":"IFERROR(IF(Q32=\"ACC\",E32*((12/S32)-(12/F32))*U32,E32*(S32-F32)*U32),\"\")","v":0},0]
[null,null,"≤ 0.52 IPLV"]
[]
["TABLE 1A: CHILLER PLANT OPERATING PARAMETERS"]
["Chiller Type","Tons","Evaporator",null,null,null,"Condenser",null,null,null,"Peak kW/ton",null,"IPLV kW/ton"]
[null,null,"Gallons per minute",null,"Entering Water Temperature","Leaving Water Temperature","Gallons per minute",null,"Entering Water Temperature","Leaving Water Temperature"]
["Water Cooled Centrifugal Chillers",1000,1500,null,"56 F","40 F",3000,null,"76 F","85.22 F",0.54500000000000004,null,0.498]
[]
[]
[]
[]
[]
["TABLE 2: HVAC CHILLER INCENTIVES - VFD-CONTROLLED CHILLERS"]
["Type","Unit Size - ARI Net Tons","Minimum Efficiency \n(Full Load and IPLV)","Building Type","Proposed Equipment",null,null,null,"Incentives"]
[null,null,null,null,"Chiller Size (Net Tons)","Full Load",null,"IPLV","Base Unit Incentive per Ton","Base Total Incentive","Performance Incentive per Ton (Capped at $125/ton for air cooled chillers)","Performance Total Incentive","Requested Incentive",null,null,null,"Chiller Type","Single Speed or VFD Controlled","Base Unit Efficiency",null,"Comm_Coincidence_Factor","Comm_Coincidence_Factor_Winter","EFLHC","Total kWh Saved","Total kW Summer Saved","Total kW Winter Saved"]
[null,null,null,null,null,null,null,null,null,null,null,null,null,null,null,null,null,null,"Full Load \n(EER for Air-Cooled)","IPLV"]
["Air Cooled Chiller with Condenser\n","< 150 tons","10.2 EER",null,null,null,null,null,10,{"$f":"IF(AND(F48>=10.2,H48>=13.34),E48*I48,0)","v":0},4,{"$f":"IF(AND(J48>0,(F48-10.2)>=(H48-13.36),((F48-10.2)*10*E48*K48)>=(125*E48)),125*E48,IF(AND(J48>0,(F48-10.2)>=(H48-13.36),((F48-10.2)*10*E48*K48)<(125*E48)),(F48-10.2)*10*E48*K48,IF(AND(J48>0,(F48-10.2)<(H48-13.36),((H48-13.36)*10*E48*K48)>=(125*E48)),125*E48,IF(AND(J48>0,(F48-10.2)<(H48-13.36),((H48-13.36)*10*E48*K48)<(125*E48)),(H48-13.36)*10*E48*K48,0))))","v":0},{"$f":"J48+L48","v":0},null,null,null,"ACC","VFD Controlled",{"$f":"ROUND(IF($R48=\"Single Speed\",INDEX('Program Info Tables'!$P$4:$S$7,IF(ISNA(MATCH($E48,'Program Info Tables'!$O$4:$O$7,1)),1,MATCH($E48,'Program Info Tables'!$O$4:$O$7,1)+1),MATCH($Q48,'Program Info Tables'!$P$3:$S$3,0)),IF($R48=\"VFD Controlled\",INDEX('Program Info Tables'!$P$4:$S$7,IF(ISNA(MATCH($E48,'Program Info Tables'!$O$4:$O$7,1)),1,MATCH($E48,'Program Info Tables'!$O$4:$O$7,1)+1),MATCH($Q48,'Program Info Tables'!$P$3:$S$3,0)),\"\")),3)","v":9.5540000000000003},{"$f":"ROUND(IF($R48=\"Single Speed\",INDEX('Program Info Tables'!$P$11:$S$14,IF(ISNA(MATCH($E48,'Program Info Tables'!$O$4:$O$7,1)),1,MATCH($E48,'Program Info Tables'!$O$4:$O$7,1)+1),MATCH($Q48,'Program Info Tables'!$P$3:$S$3,0)),IF($R48=\"VFD Controlled\",INDEX('Program Info Tables'!$P$11:$S$14,IF(ISNA(MATCH($E48,'Program Info Tables'!$O$4:$O$7,1)),1,MATCH($E48,'Program Info Tables'!$O$4:$O$7,1)+1),MATCH($Q48,'Program Info Tables'!$P$3:$S$3,0)),\"\")),3)","v":10.407999999999999},0.8,0.09,{"$f":"IFERROR(VLOOKUP(D48,Validation!$B$582:$E$594,4,0),\"\")","v":""},{"$f":"IFERROR(IF(Q48=\"ACC\",E48*((12/T48)-(12/H48))*W48,E48*(T48-H48)*W48),\"\")","v":""},{"$f":"IFERROR(IF(Q48=\"ACC\",E48*((12/S48)-(12/F48))*U48,E48*(S48-F48)*U48),\"\")","v":""},{"$f":"IFERROR(IF(Q48=\"ACC\",E48*((12/S48)-(12/F48))*V48,E48*(S48-F48)*V48),\"\")","v":""}]
[null,null,"13.36 IPLV"]
[null,"≥ 150 tons","10.2 EER",null,null,null,null,null,10,{"$f":"IF(AND(F50>=10.2,H50>=13.6),E50*I50,0)","v":0},4,{"$f":"IF(AND(J50>0,(F50-10.2)>=(H50-13.8),((F50-10.2)*10*E50*K50)>=(125*E50)),125*E50,IF(AND(J50>0,(F50-10.2)>=(H50-13.8),((F50-10.2)*10*E50*K50)<(125*E50)),(F50-10.2)*10*E50*K50,IF(AND(J50>0,(F50-10.2)<(H50-13.8),((H50-13.8)*10*E50*K50)>=(125*E50)),125*E50,IF(AND(J50>0,(F50-10.2)<(H50-13.8),((H50-13.8)*10*E50*K50)<(125*E50)),(H50-13.8)*10*E50*K50,0))))","v":0},{"$f":"J50+L50","v":0},null,null,null,"ACC","VFD Controlled",{"$f":"ROUND(IF($R50=\"Single Speed\",INDEX('Program Info Tables'!$P$4:$S$7,IF(ISNA(MATCH($E50,'Program Info Tables'!$O$4:$O$7,1)),1,MATCH($E50,'Program Info Tables'!$O$4:$O$7,1)+1),MATCH($Q50,'Program Info Tables'!$P$3:$S$3,0)),IF($R50=\"VFD Controlled\",INDEX('Program Info Tables'!$P$4:$S$7,IF(ISNA(MATCH($E50,'Program Info Tables'!$O$4:$O$7,1)),1,MATCH($E50,'Program Info Tables'!$O$4:$O$7,1)+1),MATCH($Q50,'Program Info Tables'!$P$3:$S$3,0)),\"\")),3)","v":9.5540000000000003},{"$f":"ROUND(IF($R50=\"Single Speed\",INDEX('Program Info Tables'!$P$11:$S$14,IF(ISNA(MATCH($E50,'Program Info Tables'!$O$4:$O$7,1)),1,MATCH($E50,'Program Info Tables'!$O$4:$O$7,1)+1),MATCH($Q50,'Program Info Tables'!$P$3:$S$3,0)),IF($R50=\"VFD Controlled\",INDEX('Program Info Tables'!$P$11:$S$14,IF(ISNA(MATCH($E50,'Program Info Tables'!$O$4:$O$7,1)),1,MATCH($E50,'Program Info Tables'!$O$4:$O$7,1)+1),MATCH($Q50,'Program Info Tables'!$P$3:$S$3,0)),\"\")),3)","v":10.407999999999999},0.8,0.09,{"$f":"IFERROR(VLOOKUP(D50,Validation!$B$582:$E$594,4,0),\"\")","v":""},{"$f":"IFERROR(IF(Q50=\"ACC\",E50*((12/T50)-(12/H50))*W50,E50*(T50-H50)*W50),\"\")","v":""},{"$f":"IFERROR(IF(Q50=\"ACC\",E50*((12/S50)-(12/F50))*U50,E50*(S50-F50)*U50),\"\")","v":""},0]
[null,null,"13.8 IPLV"]
["Water Cooled Screw  Chillers","< 150 tons","≤ 0.73 kW/ton",null,null,null,null,null,20,{"$f":"IF(OR(AND(F52<=0.73,F52>0,H52<=0.54,H52>0)),E52*I52,0)","v":0},6,{"$f":"IF(OR(AND(J52>0,(0.73-F52)>=(0.54-H52))),(0.73-F52)*100*E52*K52,IF(OR(AND(J52>0,(0.73-F52)<(0.54-H52))),(0.54-H52)*100*E52*K52,0))","v":0},{"$f":"J52+L52","v":0},null,null,null,"WCSC","VFD Controlled",{"$f":"ROUND(IF($R52=\"Single Speed\",INDEX('Program Info Tables'!$P$4:$S$7,IF(ISNA(MATCH($E52,'Program Info Tables'!$O$4:$O$7,1)),1,MATCH($E52,'Program Info Tables'!$O$4:$O$7,1)+1),MATCH($Q52,'Program Info Tables'!$P$3:$S$3,0)),IF($R52=\"VFD Controlled\",INDEX('Program Info Tables'!$P$4:$S$7,IF(ISNA(MATCH($E52,'Program Info Tables'!$O$4:$O$7,1)),1,MATCH($E52,'Program Info Tables'!$O$4:$O$7,1)+1),MATCH($Q52,'Program Info Tables'!$P$3:$S$3,0)),\"\")),3)","v":0.79},{"$f":"ROUND(IF($R52=\"Single Speed\",INDEX('Program Info Tables'!$P$11:$S$14,IF(ISNA(MATCH($E52,'Program Info Tables'!$O$4:$O$7,1)),1,MATCH($E52,'Program Info Tables'!$O$4:$O$7,1)+1),MATCH($Q52,'Program Info Tables'!$P$3:$S$3,0)),IF($R52=\"VFD Controlled\",INDEX('Program Info Tables'!$P$11:$S$14,IF(ISNA(MATCH($E52,'Program Info Tables'!$O$4:$O$7,1)),1,MATCH($E52,'Program Info Tables'!$O$4:$O$7,1)+1),MATCH($Q52,'Program Info Tables'!$P$3:$S$3,0)),\"\")),3)","v":0.67600000000000005},0.8,0.09,{"$f":"IFERROR(VLOOKUP(D52,Validation!$B$582:$E$594,4,0),\"\")","v":""},{"$f":"IFERROR(IF(Q52=\"ACC\",E52*((12/T52)-(12/H52))*W52,E52*(T52-H52)*W52),\"\")","v":""},{"$f":"IFERROR(IF(Q52=\"ACC\",E52*((12/S52)-(12/F52))*U52,E52*(S52-F52)*U52),\"\")","v":0},0]
[null,null,"≤ 0.54 IPLV"]
[null,"≥ 150 tons and \n< 300 tons","≤ 0.61 kW/ton",null,null,null,null,null,15,{"$f":"IF(OR(AND(F54<=0.61,F54>0,H54<=0.44,H54>0)),E54*I54,0)","v":0},6,{"$f":"IF(OR(AND(J54>0,(0.61-F54)>=(0.44-H54))),(0.61-F54)*100*E54*K54,IF(OR(AND(J54>0,(0.61-F54)<(0.44-H54))),(0.44-H54)*100*E54*K54,0))","v":0},{"$f":"J54+L54","v":0},null,null,null,"WCSC","VFD Controlled",{"$f":"ROUND(IF($R54=\"Single Speed\",INDEX('Program Info Tables'!$P$4:$S$7,IF(ISNA(MATCH($E54,'Program Info Tables'!$O$4:$O$7,1)),1,MATCH($E54,'Program Info Tables'!$O$4:$O$7,1)+1),MATCH($Q54,'Program Info Tables'!$P$3:$S$3,0)),IF($R54=\"VFD Controlled\",INDEX('Program Info Tables'!$P$4:$S$7,IF(ISNA(MATCH($E54,'Program Info Tables'!$O$4:$O$7,1)),1,MATCH($E54,'Program Info Tables'!$O$4:$O$7,1)+1),MATCH($Q54,'Program Info Tables'!$P$3:$S$3,0)),\"\")),3)","v":0.79},{"$f":"ROUND(IF($R54=\"Single Speed\",INDEX('Program Info Tables'!$P$11:$S$14,IF(ISNA(MATCH($E54,'Program Info Tables'!$O$4:$O$7,1)),1,MATCH($E54,'Program Info Tables'!$O$4:$O$7,1)+1),MATCH($Q54,'Program Info Tables'!$P$3:$S$3,0)),IF($R54=\"VFD Controlled\",INDEX('Program Info Tables'!$P$11:$S$14,IF(ISNA(MATCH($E54,'Program Info Tables'!$O$4:$O$7,1)),1,MATCH($E54,'Program Info Tables'!$O$4:$O$7,1)+1),MATCH($Q54,'Program Info Tables'!$P$3:$S$3,0)),\"\")),3)","v":0.67600000000000005},0.8,0.09,{"$f":"IFERROR(VLOOKUP(D54,Validation!$B$582:$E$594,4,0),\"\")","v":""},{"$f":"IFERROR(IF(Q54=\"ACC\",E54*((12/T54)-(12/H54))*W54,E54*(T54-H54)*W54),\"\")","v":""},{"$f":"IFERROR(IF(Q54=\"ACC\",E54*((12/S54)-(12/F54))*U54,E54*(S54-F54)*U54),\"\")","v":0},0]
[null,null,"≤ 0.44 IPLV"]
[null,"≥ 300","≤ 0.58 kW/ton",null,null,null,null,null,10,{"$f":"IF(OR(AND(F56<=0.58,F56>0,H56<=0.44,H56>0)),E56*I56,0)","v":0},3,{"$f":"IF(OR(AND(J56>0,(0.58-F56)>=(0.44-H56))),(0.58-F56)*100*E56*K56,IF(OR(AND(J56>0,(0.58-F56)<(0.44-H56))),(0.44-H56)*100*E56*K56,0))","v":0},{"$f":"J56+L56","v":0},null,null,null,"WCSC","VFD Controlled",{"$f":"ROUND(IF($R56=\"Single Speed\",INDEX('Program Info Tables'!$P$4:$S$7,IF(ISNA(MATCH($E56,'Program Info Tables'!$O$4:$O$7,1)),1,MATCH($E56,'Program Info Tables'!$O$4:$O$7,1)+1),MATCH($Q56,'Program Info Tables'!$P$3:$S$3,0)),IF($R56=\"VFD Controlled\",INDEX('Program Info Tables'!$P$4:$S$7,IF(ISNA(MATCH($E56,'Program Info Tables'!$O$4:$O$7,1)),1,MATCH($E56,'Program Info Tables'!$O$4:$O$7,1)+1),MATCH($Q56,'Program Info Tables'!$P$3:$S$3,0)),\"\")),3)","v":0.79},{"$f":"ROUND(IF($R56=\"Single Speed\",INDEX('Program Info Tables'!$P$11:$S$14,IF(ISNA(MATCH($E56,'Program Info Tables'!$O$4:$O$7,1)),1,MATCH($E56,'Program Info Tables'!$O$4:$O$7,1)+1),MATCH($Q56,'Program Info Tables'!$P$3:$S$3,0)),IF($R56=\"VFD Controlled\",INDEX('Program Info Tables'!$P$11:$S$14,IF(ISNA(MATCH($E56,'Program Info Tables'!$O$4:$O$7,1)),1,MATCH($E56,'Program Info Tables'!$O$4:$O$7,1)+1),MATCH($Q56,'Program Info Tables'!$P$3:$S$3,0)),\"\")),3)","v":0.67600000000000005},0.8,0.09,{"$f":"IFERROR(VLOOKUP(D56,Validation!$B$582:$E$594,4,0),\"\")","v":""},{"$f":"IFERROR(IF(Q56=\"ACC\",E56*((12/T56)-(12/H56))*W56,E56*(T56-H56)*W56),\"\")","v":""},{"$f":"IFERROR(IF(Q56=\"ACC\",E56*((12/S56)-(12/F56))*U56,E56*(S56-F56)*U56),\"\")","v":0},0]
[null,null,"≤ 0.44 IPLV"]
["Water Cooled Reciprocating Chillers","< 150 tons","≤ 0.73 kW/ton",null,null,null,null,null,20,{"$f":"IF(OR(AND(F58<=0.73,F58>0,H58<=0.54,H58>0)),E58*I58,0)","v":0},6,{"$f":"IF(OR(AND(J58>0,(0.73-F58)>=(0.54-H58))),(0.73-F58)*100*E58*K58,IF(OR(AND(J58>0,(0.73-F58)<(0.54-H58))),(0.54-H58)*100*E58*K58,0))","v":0},{"$f":"J58+L58","v":0},null,null,null,"WCRC","VFD Controlled",{"$f":"ROUND(IF($R58=\"Single Speed\",INDEX('Program Info Tables'!$P$4:$S$7,IF(ISNA(MATCH($E58,'Program Info Tables'!$O$4:$O$7,1)),1,MATCH($E58,'Program Info Tables'!$O$4:$O$7,1)+1),MATCH($Q58,'Program Info Tables'!$P$3:$S$3,0)),IF($R58=\"VFD Controlled\",INDEX('Program Info Tables'!$P$4:$S$7,IF(ISNA(MATCH($E58,'Program Info Tables'!$O$4:$O$7,1)),1,MATCH($E58,'Program Info Tables'!$O$4:$O$7,1)+1),MATCH($Q58,'Program Info Tables'!$P$3:$S$3,0)),\"\")),3)","v":0.83699999999999997},{"$f":"ROUND(IF($R58=\"Single Speed\",INDEX('Program Info Tables'!$P$11:$S$14,IF(ISNA(MATCH($E58,'Program Info Tables'!$O$4:$O$7,1)),1,MATCH($E58,'Program Info Tables'!$O$4:$O$7,1)+1),MATCH($Q58,'Program Info Tables'!$P$3:$S$3,0)),IF($R58=\"VFD Controlled\",INDEX('Program Info Tables'!$P$11:$S$14,IF(ISNA(MATCH($E58,'Program Info Tables'!$O$4:$O$7,1)),1,MATCH($E58,'Program Info Tables'!$O$4:$O$7,1)+1),MATCH($Q58,'Program Info Tables'!$P$3:$S$3,0)),\"\")),3)","v":0.69599999999999995},1.8,0.09,{"$f":"IFERROR(VLOOKUP(D58,Validation!$B$582:$E$594,4,0),\"\")","v":""},{"$f":"IFERROR(IF(Q58=\"ACC\",E58*((12/T58)-(12/H58))*W58,E58*(T58-H58)*W58),\"\")","v":""},{"$f":"IFERROR(IF(Q58=\"ACC\",E58*((12/S58)-(12/F58))*U58,E58*(S58-F58)*U58),\"\")","v":0},0]
[null,null,"≤ 0.54 IPLV"]
[null,"≥ 150 tons and \n< 300 tons","≤ 0.61 kW/ton",null,null,null,null,null,15,{"$f":"IF(OR(AND(F60<=0.61,F60>0,H60<=0.44,H60>0)),E60*I60,0)","v":0},6,{"$f":"IF(OR(AND(J60>0,(0.61-F60)>=(0.44-H60))),(0.61-F60)*100*E60*K60,IF(OR(AND(J60>0,(0.61-F60)<(0.44-H60))),(0.44-H60)*100*E60*K60,0))","v":0},{"$f":"J60+L60","v":0},null,null,null,"WCRC","VFD Controlled",{"$f":"ROUND(IF($R60=\"Single Speed\",INDEX('Program Info Tables'!$P$4:$S$7,IF(ISNA(MATCH($E60,'Program Info Tables'!$O$4:$O$7,1)),1,MATCH($E60,'Program Info Tables'!$O$4:$O$7,1)+1),MATCH($Q60,'Program Info Tables'!$P$3:$S$3,0)),IF($R60=\"VFD Controlled\",INDEX('Program Info Tables'!$P$4:$S$7,IF(ISNA(MATCH($E60,'Program Info Tables'!$O$4:$O$7,1)),1,MATCH($E60,'Program Info Tables'!$O$4:$O$7,1)+1),MATCH($Q60,'Program Info Tables'!$P$3:$S$3,0)),\"\")),3)","v":0.83699999999999997},{"$f":"ROUND(IF($R60=\"Single Speed\",INDEX('Program Info Tables'!$P$11:$S$14,IF(ISNA(MATCH($E60,'Program Info Tables'!$O$4:$O$7,1)),1,MATCH($E60,'Program Info Tables'!$O$4:$O$7,1)+1),MATCH($Q60,'Program Info Tables'!$P$3:$S$3,0)),IF($R60=\"VFD Controlled\",INDEX('Program Info Tables'!$P$11:$S$14,IF(ISNA(MATCH($E60,'Program Info Tables'!$O$4:$O$7,1)),1,MATCH($E60,'Program Info Tables'!$O$4:$O$7,1)+1),MATCH($Q60,'Program Info Tables'!$P$3:$S$3,0)),\"\")),3)","v":0.69599999999999995},2.8,0.09,{"$f":"IFERROR(VLOOKUP(D60,Validation!$B$582:$E$594,4,0),\"\")","v":""},{"$f":"IFERROR(IF(Q60=\"ACC\",E60*((12/T60)-(12/H60))*W60,E60*(T60-H60)*W60),\"\")","v":""},{"$f":"IFERROR(IF(Q60=\"ACC\",E60*((12/S60)-(12/F60))*U60,E60*(S60-F60)*U60),\"\")","v":0},0]
[null,null,"≤ 0.44 IPLV"]
[null,"≥ 300","≤ 0.58 kW/ton",null,null,null,null,null,10,{"$f":"IF(OR(AND(F62<=0.58,F62>0,H62<=0.44,H62>0)),E62*I62,0)","v":0},3,{"$f":"IF(OR(AND(J62>0,(0.58-F62)>=(0.44-H62))),(0.58-F62)*100*E62*K62,IF(OR(AND(J62>0,(0.58-F62)<(0.44-H62))),(0.44-H62)*100*E62*K62,0))","v":0},{"$f":"J62+L62","v":0},null,null,null,"WCRC","VFD Controlled",{"$f":"ROUND(IF($R62=\"Single Speed\",INDEX('Program Info Tables'!$P$4:$S$7,IF(ISNA(MATCH($E62,'Program Info Tables'!$O$4:$O$7,1)),1,MATCH($E62,'Program Info Tables'!$O$4:$O$7,1)+1),MATCH($Q62,'Program Info Tables'!$P$3:$S$3,0)),IF($R62=\"VFD Controlled\",INDEX('Program Info Tables'!$P$4:$S$7,IF(ISNA(MATCH($E62,'Program Info Tables'!$O$4:$O$7,1)),1,MATCH($E62,'Program Info Tables'!$O$4:$O$7,1)+1),MATCH($Q62,'Program Info Tables'!$P$3:$S$3,0)),\"\")),3)","v":0.83699999999999997},{"$f":"ROUND(IF($R62=\"Single Speed\",INDEX('Program Info Tables'!$P$11:$S$14,IF(ISNA(MATCH($E62,'Program Info Tables'!$O$4:$O$7,1)),1,MATCH($E62,'Program Info Tables'!$O$4:$O$7,1)+1),MATCH($Q62,'Program Info Tables'!$P$3:$S$3,0)),IF($R62=\"VFD Controlled\",INDEX('Program Info Tables'!$P$11:$S$14,IF(ISNA(MATCH($E62,'Program Info Tables'!$O$4:$O$7,1)),1,MATCH($E62,'Program Info Tables'!$O$4:$O$7,1)+1),MATCH($Q62,'Program Info Tables'!$P$3:$S$3,0)),\"\")),3)","v":0.69599999999999995},3.8,0.09,{"$f":"IFERROR(VLOOKUP(D62,Validation!$B$582:$E$594,4,0),\"\")","v":""},{"$f":"IFERROR(IF(Q62=\"ACC\",E62*((12/T62)-(12/H62))*W62,E62*(T62-H62)*W62),\"\")","v":""},{"$f":"IFERROR(IF(Q62=\"ACC\",E62*((12/S62)-(12/F62))*U62,E62*(S62-F62)*U62),\"\")","v":0},0]
[null,null,"≤ 0.44 IPLV"]
["Water Cooled Centrifugal Chillers","< 300 tons","≤ 0.59 kW/ton",null,null,null,null,null,10,{"$f":"IF(OR(AND(F64<=0.59,F64>0,H64<=0.42,H64>0)),E64*I64,0)","v":0},5,{"$f":"IF(OR(AND(J64>0,(0.59-F64)>=(0.42-H64))),(0.59-F64)*100*E64*K64,IF(OR(AND(J64>0,(0.59-F64)<(0.42-H64))),(0.42-H64)*100*E64*K64,0))","v":0},{"$f":"J64+L64","v":0},null,null,null,"WCCC","VFD Controlled",{"$f":"ROUND(IF($R64=\"Single Speed\",INDEX('Program Info Tables'!$P$4:$S$7,IF(ISNA(MATCH($E64,'Program Info Tables'!$O$4:$O$7,1)),1,MATCH($E64,'Program Info Tables'!$O$4:$O$7,1)+1),MATCH($Q64,'Program Info Tables'!$P$3:$S$3,0)),IF($R64=\"VFD Controlled\",INDEX('Program Info Tables'!$P$4:$S$7,IF(ISNA(MATCH($E64,'Program Info Tables'!$O$4:$O$7,1)),1,MATCH($E64,'Program Info Tables'!$O$4:$O$7,1)+1),MATCH($Q64,'Program Info Tables'!$P$3:$S$3,0)),\"\")),3)","v":0.70299999999999996},{"$f":"ROUND(IF($R64=\"Single Speed\",INDEX('Program Info Tables'!$P$11:$S$14,IF(ISNA(MATCH($E64,'Program Info Tables'!$O$4:$O$7,1)),1,MATCH($E64,'Program Info Tables'!$O$4:$O$7,1)+1),MATCH($Q64,'Program Info Tables'!$P$3:$S$3,0)),IF($R64=\"VFD Controlled\",INDEX('Program Info Tables'!$P$11:$S$14,IF(ISNA(MATCH($E64,'Program Info Tables'!$O$4:$O$7,1)),1,MATCH($E64,'Program Info Tables'!$O$4:$O$7,1)+1),MATCH($Q64,'Program Info Tables'!$P$3:$S$3,0)),\"\")),3)","v":0.67},0.8,0.09,{"$f":"IFERROR(VLOOKUP(D64,Validation!$B$582:$E$594,4,0),\"\")","v":""},{"$f":"IFERROR(IF(Q64=\"ACC\",E64*((12/T64)-(12/H64))*W64,E64*(T64-H64)*W64),\"\")","v":""},{"$f":"IFERROR(IF(Q64=\"ACC\",E64*((12/S64)-(12/F64))*U64,E64*(S64-F64)*U64),\"\")","v":0},0]
[null,null,"≤ 0.42 IPLV"]
[null,"≥ 300 and    \n< 600 tons","≤ 0.58 kW/ton",null,null,null,null,null,10,{"$f":"IF(OR(AND(F66<=0.58,F66>0,H66<=0.38,H66>0)),E66*I66,0)","v":0},4,{"$f":"IF(OR(AND(J66>0,(0.58-F66)>=(0.38-H66))),(0.58-F66)*100*E66*K66,IF(OR(AND(J66>0,(0.58-F66)<(0.38-H66))),(0.38-H66)*100*E66*K66,0))","v":0},{"$f":"J66+L66","v":0},null,null,null,"WCCC","VFD Controlled",{"$f":"ROUND(IF($R66=\"Single Speed\",INDEX('Program Info Tables'!$P$4:$S$7,IF(ISNA(MATCH($E66,'Program Info Tables'!$O$4:$O$7,1)),1,MATCH($E66,'Program Info Tables'!$O$4:$O$7,1)+1),MATCH($Q66,'Program Info Tables'!$P$3:$S$3,0)),IF($R66=\"VFD Controlled\",INDEX('Program Info Tables'!$P$4:$S$7,IF(ISNA(MATCH($E66,'Program Info Tables'!$O$4:$O$7,1)),1,MATCH($E66,'Program Info Tables'!$O$4:$O$7,1)+1),MATCH($Q66,'Program Info Tables'!$P$3:$S$3,0)),\"\")),3)","v":0.70299999999999996},{"$f":"ROUND(IF($R66=\"Single Speed\",INDEX('Program Info Tables'!$P$11:$S$14,IF(ISNA(MATCH($E66,'Program Info Tables'!$O$4:$O$7,1)),1,MATCH($E66,'Program Info Tables'!$O$4:$O$7,1)+1),MATCH($Q66,'Program Info Tables'!$P$3:$S$3,0)),IF($R66=\"VFD Controlled\",INDEX('Program Info Tables'!$P$11:$S$14,IF(ISNA(MATCH($E66,'Program Info Tables'!$O$4:$O$7,1)),1,MATCH($E66,'Program Info Tables'!$O$4:$O$7,1)+1),MATCH($Q66,'Program Info Tables'!$P$3:$S$3,0)),\"\")),3)","v":0.67},0.8,0.09,{"$f":"IFERROR(VLOOKUP(D66,Validation!$B$582:$E$594,4,0),\"\")","v":""},{"$f":"IFERROR(IF(Q66=\"ACC\",E66*((12/T66)-(12/H66))*W66,E66*(T66-H66)*W66),\"\")","v":""},{"$f":"IFERROR(IF(Q66=\"ACC\",E66*((12/S66)-(12/F66))*U66,E66*(S66-F66)*U66),\"\")","v":0},0]
[null,null,"≤ 0.38 IPLV"]
[null,"≥ 600 tons","≤ 0.57 kW/ton",null,null,null,null,null,10,{"$f":"IF(OR(AND(F68<=0.57,F68>0,H68<=0.38,H68>0)),E68*I68,0)","v":0},3,{"$f":"IF(OR(AND(J68>0,(0.57-F68)>=(0.38-H68))),(0.57-F68)*100*E68*K68,IF(OR(AND(J68>0,(0.57-F68)<(0.38-H68))),(0.38-H68)*100*E68*K68,0))","v":0},{"$f":"J68+L68","v":0},null,null,null,"WCCC","VFD Controlled",{"$f":"ROUND(IF($R68=\"Single Speed\",INDEX('Program Info Tables'!$P$4:$S$7,IF(ISNA(MATCH($E68,'Program Info Tables'!$O$4:$O$7,1)),1,MATCH($E68,'Program Info Tables'!$O$4:$O$7,1)+1),MATCH($Q68,'Program Info Tables'!$P$3:$S$3,0)),IF($R68=\"VFD Controlled\",INDEX('Program Info Tables'!$P$4:$S$7,IF(ISNA(MATCH($E68,'Program Info Tables'!$O$4:$O$7,1)),1,MATCH($E68,'Program Info Tables'!$O$4:$O$7,1)+1),MATCH($Q68,'Program Info Tables'!$P$3:$S$3,0)),\"\")),3)","v":0.70299999999999996},{"$f":"ROUND(IF($R68=\"Single Speed\",INDEX('Program Info Tables'!$P$11:$S$14,IF(ISNA(MATCH($E68,'Program Info Tables'!$O$4:$O$7,1)),1,MATCH($E68,'Program Info Tables'!$O$4:$O$7,1)+1),MATCH($Q68,'Program Info Tables'!$P$3:$S$3,0)),IF($R68=\"VFD Controlled\",INDEX('Program Info Tables'!$P$11:$S$14,IF(ISNA(MATCH($E68,'Program Info Tables'!$O$4:$O$7,1)),1,MATCH($E68,'Program Info Tables'!$O$4:$O$7,1)+1),MATCH($Q68,'Program Info Tables'!$P$3:$S$3,0)),\"\")),3)","v":0.67},0.8,0.09,{"$f":"IFERROR(VLOOKUP(D68,Validation!$B$582:$E$594,4,0),\"\")","v":""},{"$f":"IFERROR(IF(Q68=\"ACC\",E68*((12/T68)-(12/H68))*W68,E68*(T68-H68)*W68),\"\")","v":""},{"$f":"IFERROR(IF(Q68=\"ACC\",E68*((12/S68)-(12/F68))*U68,E68*(S68-F68)*U68),\"\")","v":0},0]
[null,null,"≤ 0.38 IPLV"]
[]
["TABLE 2A: CHILLER PLANT OPERATING PARAMETERS"]
["Chiller Type","Tons","Evaporator",null,null,null,"Condenser",null,null,null,"Peak kW/ton",null,"IPLV kW/ton"]
[null,null,"Gallons per minute",null,"Entering Water Temperature","Leaving Water Temperature","Gallons per minute",null,"Entering Water Temperature","Leaving Water Temperature"]
["Water Cooled Centrifugal Chillers",1000,1500,null,"56 F","40 F",3000,null,"76 F","85.22 F",0.54500000000000004,null,0.498]
[]
[]
[]
[]
[null,null,null,null,null,null,null,null,null,null,null,null,{"$f":"\"Version \"  &  'Version Tracking'!C4","v":"Version 15.2"}]

{"sheet":"Validation","index":12,"n_rows":594,"n_cols":30,"rows_kept":594,"cut":false,"hidden":true,"merged":[[548,22,548,24],[549,19,549,24],[10,3,10,4],[10,5,10,6],[29,1,29,2],[523,18,523,19],[523,20,524,20],[548,18,550,18],[548,19,548,21]]}
[]
[null,null,"Equipment Name","Measure Code","System Type","Split/Packaged","Incentive Per","Winter Peak CF"]
[null,null,"Split System A/C","S","AC","S","Ton",0.03]
[null,null,"Unitary A/C","U","AC","P","Ton",0.03]
[null,null,"Split System Heat Pump","SH","HP","S","Ton",0.3]
[null,null,"Unitary Heat Pump","UH","HP","P","Ton",0.3]
[null,null,"Packaged Terminal A/C","PTAC","PTAC","P","Unit",0.28000000000000003]
[null,null,"Packaged Terminal Heat Pump","PTHP","PTHP","P","Unit",0.28000000000000003]
[]
[]
[null,null,null,"EFLHHEAT",null,"EFLHCOOL"]
[null,"3.2.2 Equivalent Full Load Hours","HVAC Measure Building Type","Charleston","Columbia","Charleston","Columbia"]
[null,null,"Assembly",475,565,3141,2888]
[null,null,"Education",434,516,1694,1558]
[null,null,"Garage",226,269,2340,2151]
[null,null,"Grocery",454,540,1966,1807]
[null,null,"Health",371,442,3285,3021]
[null,null,"Industrial",188,224,2149,1976]
[null,null,"Lodging",464,552,2311,2125]
[null,null,"Multi-Family",353,420,1960,1802]
[null,null,"Office",418,497,3056,2810]
[null,null,"Retail",348,415,1430,1315]
[null,null,"Warehouse",381,453,558,513]
[null,null,"Other",530,631,2068,1901]
[]
[]
[null,null,null,null,null,null,null,"Convenience/C-Store",{"$f":"_xlfn.CONCAT(H27,\"|\",H27,\"|\")","v":"Convenience/C-Store|Convenience/C-Store|"}]
[null,null,null,null,null,null,null,"Fitness/Recreation ",{"$f":"_xlfn.CONCAT(H28,\"|\",H28,\"|\")","v":"Fitness/Recreation |Fitness/Recreation |"}]
[null,null,null,null,null,null,null,"Grocery","Grocery|Grocery|"]
[null,"Minimum Roof Area by Building Type",null,null,null,null,null,"Health Facility","Health Facility|Health Facility|"]
[null,"Building Type","Minimum Area (sq. ft.)",null,null,null,null,"Industrial","Industrial|Industrial|"]
[null,"Office-small",5500,null,null,null,null,"Lodging","Lodging|Lodging|"]
[null,"Office-medium",17875.948254299998,null,null,null,null,"Multifamily","Multifamily|Multifamily|"]
[null,"Office-large",38352.995360100002,null,null,null,null,"Office","Office|Office|"]
[null,"Hotel-small",10800.614933099998,null,null,null,null,"Religious Facility","Religious Facility|Religious Facility|"]
[null,"Hotel-large",21300.055664400003,null,null,null,null,"Restaurant","Restaurant|Restaurant|"]
[null,"Hospital",40250,null,null,null,null,"Retail","Retail|Retail|"]
[null,"Warehouse-conditioned",49495.149157499996,null,null,null,null,"School","School|School|"]
[null,"Retail-stand alone",24692.301900899998,null,null,null,null,"University","University|University|"]
[null,"Retail-strip mall",22499.801072999995,null,null,null,null,"Warehouse","Warehouse|Warehouse|"]
[null,"School-primary",73958.82561,null,null,null,null,"Other","Other|Other|"]
[null,"School-secondary",128112.05681999998]
[null,"Other",39348.88625211818]
[]
[null,"Cool Roof Location"]
[null,"Charleston"]
[null,"Columbia"]
[null,"Greenville"]
[]
[]
[null,"Building Type","Location","ESF","DSF"]
[null,"Office-small","Charleston",0.22075680254705482,9.5861927024675118E-5]
[null,"Office-small","Columbia",0.21360585974854884,8.8201723834139672E-5]
[null,"Office-small","Greenville",0.1769502735167747,8.5956572119191162E-5]
[null,"Office-medium","Charleston",0.31856887527112832,2.0566853001018485E-4]
[null,"Office-medium","Columbia",0.29665648373338921,1.941262052582447E-4]
[null,"Office-medium","Greenville",0.22249624797583875,1.5668427543843804E-4]
[null,"Office-large","Charleston",0.4082361429922543,3.3820174612736529E-4]
[null,"Office-large","Columbia",0.37354041685791445,1.0290695584381792E-4]
[null,"Office-large","Greenville",0.27691390607861599,1.043845457808832E-4]
[null,"Hotel-small","Charleston",0.2852995809503866,4.8880550160346946E-5]
[null,"Hotel-small","Columbia",0.24275671159481482,6.1577049466120121E-5]
[null,"Hotel-small","Greenville",0.13279856982031119,6.48055693435491E-5]
[null,"Hotel-large","Charleston",0.81516586100491073,5.8862756969017402E-5]
[null,"Hotel-large","Columbia",0.72445565535556211,1.5721555158172104E-4]
[null,"Hotel-large","Greenville",0.64307079795054845,1.259973233067847E-4]
[null,"Hospital","Charleston",0.83858586199362717,1.1499881129359591E-4]
[null,"Hospital","Columbia",0.83189097898017172,1.4457503088395233E-4]
[null,"Hospital","Greenville",0.79593186506259339,1.2658284098505989E-4]
[null,"Warehouse-conditioned","Charleston",0.22238012705054439,7.9799739312463408E-5]
[null,"Warehouse-conditioned","Columbia",0.21441841514906912,7.7748225139289144E-5]
[null,"Warehouse-conditioned","Greenville",0.1785618058354399,6.9729055447790967E-5]
[null,"Retail-stand alone","Charleston",0.7863460751703446,2.2693995976923271E-4]
[null,"Retail-stand alone","Columbia",0.75368089560879237,2.3249351247364811E-4]
[null,"Retail-stand alone","Greenville",0.69253690877846685,1.8801244285089472E-4]
[null,"Retail-strip mall","Charleston",0.80161594331044717,1.0165378763035654E-4]
[null,"Retail-strip mall","Columbia",0.7676493753225393,1.7281975015619703E-4]
[null,"Retail-strip mall","Greenville",0.72308662098521725,1.6293832945924705E-4]
[null,"School-primary","Charleston",0.96279149150157983,3.5629297494465758E-4]
[null,"School-primary","Columbia",0.90432985458783754,3.8609239349710636E-4]
[null,"School-primary","Greenville",0.79313855569805836,3.2936204434141729E-4]
[null,"School-secondary","Charleston",1.0196797136264741,3.2202043292430812E-4]
[null,"School-secondary","Columbia",0.97894534856467141,3.5636809784535999E-4]
[null,"School-secondary","Greenville",0.90728886235400319,3.1560269192156193E-4]
[null,"Other","Charleston",0.60722058867443207,1.771982923787458E-4]
[null,"Other","Columbia",0.57290272686393739,1.7946586327087242E-4]
[null,"Other","Greenville",0.50388858309598805,1.57277790090438E-4]
[]
[]
[null,"county","Cool Roof Representative Zone"]
[null,"Abbeville","Columbia"]
[null,"Aiken","Columbia"]
[null,"Allendale","Columbia"]
[null,"Bamberg","Columbia"]
[null,"Barnwell","Columbia"]
[null,"Beaufort","Charleston"]
[null,"Berkeley","Charleston"]
[null,"Calhoun","Columbia"]
[null,"Charleston","Charleston"]
[null,"Colleton","Charleston"]
[null,"Dorchester","Charleston"]
[null,"Edgefield","Columbia"]
[null,"Fairfield","Columbia"]
[null,"Hampton","Charleston"]
[null,"Jasper","Charleston"]
[null,"Lexington","Columbia"]
[null,"McCormick","Columbia"]
[null,"Orangeburg","Columbia"]
[null,"Richland","Columbia"]
[null,"Richland/Fairfield","Columbia"]
[null,"Richland/Kershaw","Columbia"]
[null,"Saluda","Columbia"]
[]
[]
[null,"Zip","County","Cool Roof Zone"]
[null,29901,"Beaufort",{"$f":"VLOOKUP(C116,$B$91:$C$112,2,FALSE)","v":"Charleston"}]
[null,{"$f":"B116+1","v":29902},"Beaufort",{"$f":"VLOOKUP(C117,$B$91:$C$112,2,FALSE)","v":"Charleston"}]
[null,29902,"Beaufort","Charleston"]
[null,29902,"Beaufort","Charleston"]
[null,{"$f":"B119+1","v":29903},"Beaufort","Charleston"]
[null,{"$f":"B120+1","v":29904},"Beaufort","Charleston"]
[null,29906,"Beaufort","Charleston"]
[null,29906,"Beaufort","Charleston"]
[null,29910,"Beaufort","Charleston"]
[null,29910,"Beaufort","Charleston"]
[null,29910,"Beaufort","Charleston"]
[null,29910,"Beaufort","Charleston"]
[null,{"$f":"B127+1","v":29911},"Beaufort","Charleston"]
[null,29911,"Hampton","Charleston"]
[null,29913,"Hampton","Charleston"]
[null,29914,"Beaufort","Charleston"]
[null,29915,"Beaufort","Charleston"]
[null,29916,"Hampton","Charleston"]
[null,29918,"Hampton","Charleston"]
[null,29922,"Hampton","Charleston"]
[null,29923,"Hampton","Charleston"]
[null,29924,"Hampton","Charleston"]
[null,29925,"Beaufort","Charleston"]
[null,29926,"Beaufort","Charleston"]
[null,29928,"Beaufort","Charleston"]
[null,29933,"Hampton","Charleston"]
[null,29935,"Beaufort","Charleston"]
[null,29936,"Jasper","Charleston"]
[null,29945,"Jasper","Charleston"]
[null,29945,"Jasper","Charleston"]
[null,29931,"Beaufort","Charleston"]
[null,29938,"Beaufort","Charleston"]
[null,29939,"Hampton","Charleston"]
[null,29943,"Jasper","Charleston"]
[null,29944,"Hampton","Charleston"]
[null,29936,"Jasper","Charleston"]
[null,29927,"Jasper","Charleston"]
[null,29941,"Beaufort","Charleston"]
[null,29943,"Jasper","Charleston"]
[null,29929,"Colleton","Charleston"]
[null,29932,"Hampton","Charleston"]
[null,29934,"Jasper","Charleston"]
[null,29936,"Jasper","Charleston"]
[null,29936,"Jasper","Charleston"]
[null,29016,"Richland/Fairfield","Columbia"]
[null,29044,"Richland","Columbia"]
[null,29045,"Richland/Kershaw","Columbia"]
[null,29052,"Richland","Columbia"]
[null,29061,"Richland","Columbia"]
[null,29177,"Richland","Columbia"]
[null,29201,"Richland","Columbia"]
[null,29202,"Richland","Columbia"]
[null,29203,"Richland","Columbia"]
[null,29204,"Richland","Columbia"]
[null,29205,"Richland","Columbia"]
[null,29206,"Richland","Columbia"]
[null,29207,"Richland","Columbia"]
[null,29208,"Richland","Columbia"]
[null,29209,"Richland","Columbia"]
[null,29211,"Richland","Columbia"]
[null,29216,"Richland","Columbia"]
[null,{"$f":"B176+1","v":29217},"Richland","Columbia"]
[null,{"$f":"B177+1","v":29218},"Richland","Columbia"]
[null,{"$f":"B178+1","v":29219},"Richland","Columbia"]
[null,{"$f":"B179+1","v":29220},"Richland","Columbia"]
[null,29214,"Richland",{"$f":"VLOOKUP(C181,$B$91:$C$112,2,FALSE)","v":"Columbia"}]
[null,{"$f":"B181+1","v":29215},"Richland","Columbia"]
[null,{"$f":"B182+1","v":29216},"Richland","Columbia"]
[null,{"$f":"B183+1","v":29217},"Richland","Columbia"]
[null,{"$f":"B184+1","v":29218},"Richland","Columbia"]
[null,{"$f":"B185+1","v":29219},"Richland","Columbia"]
[null,29210,"Richland","Columbia"]
[null,{"$f":"B187+1","v":29211},"Richland","Columbia"]
[null,{"$f":"B188+1","v":29212},"Richland","Columbia"]
[null,29212,"Richland","Columbia"]
[null,29215,"Richland","Columbia"]
[null,{"$f":"B191+1","v":29216},"Richland","Columbia"]
[null,{"$f":"B192+1","v":29217},"Richland","Columbia"]
[null,{"$f":"B193+1","v":29218},"Richland","Columbia"]
[null,29223,"Richland",{"$f":"VLOOKUP(C195,$B$91:$C$112,2,FALSE)","v":"Columbia"}]
[null,29240,"Richland","Columbia"]
[null,29250,"Richland","Columbia"]
[null,29260,"Richland","Columbia"]
[null,29260,"Richland","Columbia"]
[null,29290,"Richland","Columbia"]
[null,29292,"Richland","Columbia"]
[null,29147,"Richland","Columbia"]
[null,29461,"Berkeley","Charleston"]
[null,29445,"Berkeley","Charleston"]
[null,29456,"Berkeley","Charleston"]
[null,29436,"Berkeley","Charleston"]
[null,29461,"Berkeley","Charleston"]
[null,29920,"Berkeley","Charleston"]
[null,29437,"Charleston","Charleston"]
[null,29439,"Charleston","Charleston"]
[null,29422,"Charleston","Charleston"]
[null,29470,"Charleston","Charleston"]
[null,29449,"Charleston","Charleston"]
[null,29417,"Charleston","Charleston"]
[null,29415,"Charleston","Charleston"]
[null,29405,"Charleston","Charleston"]
[null,29420,"Charleston","Charleston"]
[null,29410,"Charleston","Charleston"]
[null,29426,"Charleston","Charleston"]
[null,29404,"Charleston","Charleston"]
[null,29455,"Charleston","Charleston"]
[null,29455,"Charleston","Charleston"]
[null,29414,"Charleston","Charleston"]
[null,29457,"Charleston","Charleston"]
[null,{"$f":"B224+1","v":29458},"Charleston","Charleston"]
[null,29401,"Charleston","Charleston"]
[null,29407,"Charleston","Charleston"]
[null,29449,"Charleston","Charleston"]
[null,29406,"Charleston","Charleston"]
[null,29409,"Charleston","Charleston"]
[null,29413,"Charleston","Charleston"]
[null,29451,"Charleston","Charleston"]
[null,29418,"Charleston","Charleston"]
[null,29422,"Charleston","Charleston"]
[null,29423,"Charleston","Charleston"]
[null,29492,"Charleston","Charleston"]
[null,29451,"Charleston","Charleston"]
[null,29413,"Charleston","Charleston"]
[null,29412,"Charleston","Charleston"]
[null,29424,"Charleston","Charleston"]
[null,29425,"Charleston","Charleston"]
[null,29487,"Charleston","Charleston"]
[null,29419,"Charleston","Charleston"]
[null,{"$f":"B243+1","v":29420},"Charleston","Charleston"]
[null,29416,"Charleston","Charleston"]
[null,29417,"Charleston",{"$f":"VLOOKUP(C246,$B$91:$C$112,2,FALSE)","v":"Charleston"}]
[null,29458,"Charleston","Charleston"]
[null,29464,"Charleston","Charleston"]
[null,29465,"Charleston","Charleston"]
[null,29466,"Charleston","Charleston"]
[null,29482,"Charleston","Charleston"]
[null,29433,"Colleton","Charleston"]
[null,29435,"Colleton","Charleston"]
[null,29438,"Colleton","Charleston"]
[null,29446,"Colleton","Charleston"]
[null,29452,"Colleton","Charleston"]
[null,29488,"Colleton","Charleston"]
[null,29474,"Colleton","Charleston"]
[null,29488,"Colleton","Charleston"]
[null,29493,"Colleton","Charleston"]
[null,29475,"Colleton","Charleston"]
[null,29481,"Colleton","Charleston"]
[null,29082,"Colleton","Charleston"]
[null,29437,"Dorchester","Charleston"]
[null,29447,"Dorchester","Charleston"]
[null,29448,"Dorchester","Charleston"]
[null,29483,"Dorchester","Charleston"]
[null,29484,"Dorchester","Charleston"]
[null,29485,"Dorchester","Charleston"]
[null,29471,"Dorchester","Charleston"]
[null,29472,"Dorchester","Charleston"]
[null,29477,"Dorchester","Charleston"]
[null,29437,"Dorchester","Charleston"]
[null,29447,"Dorchester","Charleston"]
[null,29448,"Dorchester","Charleston"]
[null,29483,"Dorchester","Charleston"]
[null,29484,"Dorchester","Charleston"]
[null,29485,"Dorchester","Charleston"]
[null,29471,"Dorchester","Charleston"]
[null,29472,"Dorchester","Charleston"]
[null,29477,"Dorchester","Charleston"]
[null,29475,"Colleton","Charleston"]
[null,29481,"Colleton","Charleston"]
[null,29082,"Colleton","Charleston"]
[null,29003,"Bamberg","Columbia"]
[null,29628,"Abbeville","Columbia"]
[null,29801,"Aiken","Columbia"]
[null,29802,"Aiken","Columbia"]
[null,29803,"Aiken","Columbia"]
[null,29804,"Aiken","Columbia"]
[null,29804,"Aiken","Columbia"]
[null,29804,"Aiken","Columbia"]
[null,29805,"Aiken","Columbia"]
[null,29808,"Aiken","Columbia"]
[null,29809,"Aiken","Columbia"]
[null,29810,"Allendale","Columbia"]
[null,29812,"Barnwell","Columbia"]
[null,29813,"Barnwell","Columbia"]
[null,29816,"Aiken","Columbia"]
[null,29817,"Barnwell","Columbia"]
[null,29821,"McCormick","Columbia"]
[null,29822,"Aiken","Columbia"]
[null,29824,"Edgefield","Columbia"]
[null,29826,"Barnwell","Columbia"]
[null,29827,"Allendale","Columbia"]
[null,29828,"Aiken","Columbia"]
[null,29829,"Aiken","Columbia"]
[null,29831,"Aiken","Columbia"]
[null,29834,"Aiken","Columbia"]
[null,29839,"Aiken",{"$f":"VLOOKUP(C310,$B$91:$C$112,2,FALSE)","v":"Columbia"}]
[null,29841,"Aiken","Columbia"]
[null,29842,"Aiken","Columbia"]
[null,29850,"Aiken","Columbia"]
[null,29850,"Aiken","Columbia"]
[null,29836,"Allendale","Columbia"]
[null,29846,"Allendale","Columbia"]
[null,29846,"Allendale","Columbia"]
[null,29849,"Allendale","Columbia"]
[null,29849,"Allendale","Columbia"]
[null,29843,"Bamberg","Columbia"]
[null,29832,"Edgefield","Columbia"]
[null,29847,"Edgefield","Columbia"]
[null,29847,"Edgefield","Columbia"]
[null,29835,"McCormick","Columbia"]
[null,29838,"McCormick","Columbia"]
[null,29840,"McCormick","Columbia"]
[null,29844,"McCormick","Columbia"]
[null,29845,"McCormick","Columbia"]
[null,29851,"Aiken","Columbia"]
[null,29851,"Aiken","Columbia"]
[null,29853,"Barnwell","Columbia"]
[null,29853,"Barnwell","Columbia"]
[null,29856,"Aiken","Columbia"]
[null,29856,"Aiken","Columbia"]
[null,29860,"Aiken","Columbia"]
[null,29861,"Aiken","Columbia"]
[null,29123,"Lexington","Columbia"]
[null,29073,"Lexington","Columbia"]
[null,29133,"Orangeburg","Columbia"]
[null,29112,"Orangeburg","Columbia"]
[null,29116,"Orangeburg","Columbia"]
[null,29146,"Orangeburg","Columbia"]
[null,29135,"Calhoun","Columbia"]
[null,29015,"Fairfield","Columbia"]
[null,29065,"Fairfield","Columbia"]
[null,29106,"Fairfield","Columbia"]
[null,29135,"Orangeburg","Columbia"]
[null,29113,"Orangeburg","Columbia"]
[null,29130,"Fairfield","Columbia"]
[null,29132,"Fairfield","Columbia"]
[null,29048,"Orangeburg","Columbia"]
[null,29036,"Lexington","Columbia"]
[null,29169,"Lexington","Columbia"]
[null,29172,"Lexington","Columbia"]
[null,29176,"Fairfield","Columbia"]
[null,29170,"Lexington","Columbia"]
[null,29018,"Orangeburg","Columbia"]
[null,29170,"Lexington","Columbia"]
[null,29171,"Lexington","Columbia"]
[null,29053,"Lexington","Columbia"]
[null,29432,"Orangeburg","Columbia"]
[null,29030,"Orangeburg","Columbia"]
[null,29038,"Orangeburg","Columbia"]
[null,29171,"Lexington","Columbia"]
[null,29039,"Orangeburg","Columbia"]
[null,29054,"Lexington","Columbia"]
[null,29047,"Orangeburg","Columbia"]
[null,29059,"Orangeburg","Columbia"]
[null,29180,"Fairfield","Columbia"]
[null,29160,"Lexington","Columbia"]
[null,29071,"Lexington","Columbia"]
[null,29063,"Lexington","Columbia"]
[null,29033,"Lexington","Columbia"]
[null,29172,"Lexington",{"$f":"VLOOKUP(C374,$B$91:$C$112,2,FALSE)","v":"Columbia"}]
[null,29070,"Lexington","Columbia"]
[null,29072,"Lexington","Columbia"]
[null,29142,"Orangeburg","Columbia"]
[null,29115,"Orangeburg","Columbia"]
[null,29117,"Orangeburg","Columbia"]
[null,29163,"Orangeburg","Columbia"]
[null,29160,"Lexington","Columbia"]
[null,29169,"Lexington","Columbia"]
[null,29118,"Orangeburg","Columbia"]
[null,29006,"Lexington","Columbia"]
[null,29107,"Orangeburg","Columbia"]
[null,29107,"Orangeburg","Columbia"]
[null,29081,"Bamberg","Columbia"]
[null,29105,"Saluda","Columbia"]
[null,29129,"Saluda","Columbia"]
[null,29137,"Aiken","Columbia"]
[null,29137,"Aiken","Columbia"]
[null,29138,"Saluda","Columbia"]
[null,29138,"Saluda","Columbia"]
[null,29164,"Aiken","Columbia"]
[null,29164,"Aiken","Columbia"]
[null,29166,"Saluda","Columbia"]
[null,29166,"Saluda","Columbia"]
[null,29166,"Saluda","Columbia"]
[null,29166,"Saluda","Columbia"]
[null,29073,"Lexington","Columbia"]
[null,29042,"Bamberg","Columbia"]
[null,29461,"Berkeley","Charleston"]
[null,29445,"Berkeley","Charleston"]
[null,29456,"Berkeley","Charleston"]
[null,29436,"Berkeley","Charleston"]
[null,29461,"Berkeley","Charleston"]
[null,29920,"Berkeley","Charleston"]
[null,29437,"Charleston","Charleston"]
[null,29439,"Charleston","Charleston"]
[null,29422,"Charleston","Charleston"]
[null,29470,"Charleston","Charleston"]
[null,29449,"Charleston","Charleston"]
[null,29417,"Charleston","Charleston"]
[null,29415,"Charleston","Charleston"]
[null,29405,"Charleston","Charleston"]
[null,29420,"Charleston","Charleston"]
[null,29410,"Charleston","Charleston"]
[null,29426,"Charleston","Charleston"]
[null,29404,"Charleston","Charleston"]
[null,29455,"Charleston","Charleston"]
[null,29455,"Charleston","Charleston"]
[null,29414,"Charleston","Charleston"]
[null,29457,"Charleston","Charleston"]
[null,{"$f":"B423+1","v":29458},"Charleston","Charleston"]
[null,29401,"Charleston","Charleston"]
[null,29412,"Charleston","Charleston"]
[null,29407,"Charleston","Charleston"]
[null,29487,"Charleston","Charleston"]
[null,29418,"Charleston","Charleston"]
[null,29419,"Charleston","Charleston"]
[null,29449,"Charleston","Charleston"]
[null,{"$f":"B431+1","v":29450},"Charleston","Charleston"]
[null,29406,"Charleston","Charleston"]
[null,29409,"Charleston","Charleston"]
[null,29413,"Charleston","Charleston"]
[null,29416,"Charleston","Charleston"]
[null,29417,"Charleston","Charleston"]
[null,29422,"Charleston",{"$f":"VLOOKUP(C438,$B$91:$C$112,2,FALSE)","v":"Charleston"}]
[null,29423,"Charleston","Charleston"]
[null,29424,"Charleston","Charleston"]
[null,29425,"Charleston","Charleston"]
[null,29492,"Charleston","Charleston"]
[null,29451,"Charleston","Charleston"]
[null,29413,"Charleston","Charleston"]
[null,29451,"Charleston","Charleston"]
[null,29458,"Charleston","Charleston"]
[null,29464,"Charleston","Charleston"]
[null,29465,"Charleston","Charleston"]
[null,29466,"Charleston","Charleston"]
[null,29482,"Charleston","Charleston"]
[null,29433,"Colleton","Charleston"]
[null,29435,"Colleton","Charleston"]
[null,29438,"Colleton","Charleston"]
[null,29446,"Colleton","Charleston"]
[null,29452,"Colleton","Charleston"]
[null,29488,"Colleton","Charleston"]
[null,29474,"Colleton","Charleston"]
[null,29488,"Colleton","Charleston"]
[null,29493,"Colleton","Charleston"]
[null,29475,"Colleton","Charleston"]
[null,29481,"Colleton","Charleston"]
[null,29082,"Colleton","Charleston"]
[null,29437,"Dorchester","Charleston"]
[null,29447,"Dorchester","Charleston"]
[null,29448,"Dorchester","Charleston"]
[null,29483,"Dorchester","Charleston"]
[null,29484,"Dorchester","Charleston"]
[null,29485,"Dorchester","Charleston"]
[null,29471,"Dorchester","Charleston"]
[null,29472,"Dorchester","Charleston"]
[null,29477,"Dorchester","Charleston"]
[null,29901,"Beaufort","Charleston"]
[null,{"$f":"B472+1","v":29902},"Beaufort","Charleston"]
[null,29902,"Beaufort","Charleston"]
[null,29902,"Beaufort","Charleston"]
[null,{"$f":"B475+1","v":29903},"Beaufort","Charleston"]
[null,{"$f":"B476+1","v":29904},"Beaufort","Charleston"]
[null,29906,"Beaufort","Charleston"]
[null,29906,"Beaufort","Charleston"]
[null,29910,"Beaufort","Charleston"]
[null,29910,"Beaufort","Charleston"]
[null,29910,"Beaufort","Charleston"]
[null,29910,"Beaufort","Charleston"]
[null,{"$f":"B483+1","v":29911},"Beaufort","Charleston"]
[null,29911,"Hampton","Charleston"]
[null,29913,"Hampton","Charleston"]
[null,29914,"Beaufort","Charleston"]
[null,29915,"Beaufort","Charleston"]
[null,29916,"Hampton","Charleston"]
[null,29918,"Hampton","Charleston"]
[null,29922,"Hampton","Charleston"]
[null,29923,"Hampton","Charleston"]
[null,29924,"Hampton","Charleston"]
[null,29925,"Beaufort","Charleston"]
[null,29926,"Beaufort","Charleston"]
[null,29927,"Jasper","Charleston"]
[null,29928,"Beaufort","Charleston"]
[null,29929,"Colleton","Charleston"]
[null,29931,"Beaufort","Charleston"]
[null,29932,"Hampton","Charleston"]
[null,29933,"Hampton","Charleston"]
[null,29934,"Jasper",{"$f":"VLOOKUP(C502,$B$91:$C$112,2,FALSE)","v":"Charleston"}]
[null,29935,"Beaufort","Charleston"]
[null,29936,"Jasper","Charleston"]
[null,29936,"Jasper","Charleston"]
[null,29936,"Jasper","Charleston"]
[null,29936,"Jasper","Charleston"]
[null,29938,"Beaufort","Charleston"]
[null,29939,"Hampton","Charleston"]
[null,29941,"Beaufort","Charleston"]
[null,29943,"Jasper","Charleston"]
[null,29943,"Jasper","Charleston"]
[null,29944,"Hampton","Charleston"]
[null,29945,"Jasper","Charleston"]
[null,29945,"Jasper","Charleston"]
[]
[]
[]
[]
[null,"VFD Calculations"]
[null,null,null,null,null,null,null,null,null,null,null,null,null,null,null,null,null,null,"Dominion Energy South Carolina\nCommercial Energy Algorithm Manual October 2024 PY15"]
[]
[null,null,null,null,null,null,null,null,null,null,null,null,null,null,null,null,null,null,"Variable Frequency Drives (VFDs) for HVAC Pumps and Cooling Tower Fans",null,null,null,null,null,null,null,null,"Default Pump and Fan Annual Hours of Operation"]
[null,"Building Type","Installation Type Device Code","Device Description","VFD and Motor HP","motor efficiency","Hours","ESF","DSFs","DSFw","Electric Energy Savings (kWh)","Demand Savings Summer (kW)","Demand Savings Winter (kW)",null,null,null,null,null,"Motor Horsepower",null,"Motor Efficiency (%)",null,null,null,null,null,null,"Building Type","Heating Run Hours","Cooling Run Hours"]
[null,{"$f":"VFDs!C26","v":0},{"$f":"VFDs!B26","v":0},{"$f":"IFERROR(VLOOKUP(C525,$B$537:$C$542,2,0),0)","v":0},{"$f":"VFDs!E26","v":0},{"$f":"IF(OR(C525=\"CWP\",C525=\"HWP\",C525=\"CTF\",C525=\"WHP\"),LOOKUP(E525,$S$526:$S$536,$U$526:$U$536),IF(OR(C525=\"SAF\",C525=\"RAF\"),LOOKUP(E525,$S$552:$S$576,$U$552:$U$576),\"\"))","v":""},{"$f":"IFERROR(IF(OR(C525=\"CWP\",C525=\"CTF\"),_xlfn.XLOOKUP(B525,$AB$525:$AB$544,$AD$525:$AD$544),IF(OR(C525=\"HWP\",C525=\"WHP\"),_xlfn.XLOOKUP(B525,$AB$525:$AB$544,$AC$525:$AC$544),IF(OR(C525=\"SAF\",C525=\"RAF\"),_xlfn.XLOOKUP(B525,$AB$550:$AB$569,$AC$550:$AC$569),\"\"))),\"\")","v":""},{"$f":"IFERROR(IF(C525=\"HWP\",0.249,IF(C525=\"WHP\",0.249,IF(C525=\"CWP\",0.081,IF(C525=\"CTF\",0.502,\"\")))),\"\")","v":""},{"$f":"IFERROR(IF(C525=\"HWP\",0,IF(C525=\"WHP\",0,IF(C525=\"CWP\",0,IF(C525=\"CTF\",0.407,\"\")))),\"\")","v":""},{"$f":"IFERROR(IF(C525=\"HWP\",0.56,IF(C525=\"SAF\",0.56,IF(C525=\"RAF\",0.56,IF(C525=\"WHP\",0,IF(C525=\"CWP\",0,IF(C525=\"CTF\",0,\"\")))))),\"\")","v":""},{"$f":"IF(OR(C525=\"CWP\",C525=\"HWP\",C525=\"CTF\",C525=\"WHP\"),E525*65%/F525*G525*H525,IF(OR(C525=\"SAF\",C525=\"RAF\"),((0.746*E525*65%/F525)*G525*(1-0.3))*(1+15.7%),\"\"))","v":""},{"$f":"IF(OR(C525=\"CWP\",C525=\"HWP\",C525=\"CTF\",C525=\"WHP\"),E525*65%/F525*I525,IF(OR(C525=\"SAF\",C525=\"RAF\"),((0.746*E525*65%/F525)*(1-0.3))*(1+15.7%),\"\"))","v":""},{"$f":"IF(OR(C525=\"HWP\",C525=\"SAF\",C525=\"RAF\"),E525*65%/F525*J525,\"\")","v":""},null,null,null,null,null,"Size Min","Size Max",null,null,null,null,null,null,null,"Convenience Store",4136,2084]
[null,{"$f":"VFDs!C27","v":0},{"$f":"VFDs!B27","v":0},{"$f":"IFERROR(VLOOKUP(C526,$B$537:$C$542,2,0),0)","v":0},{"$f":"VFDs!E27","v":0},{"$f":"IF(OR(C526=\"CWP\",C526=\"HWP\",C526=\"CTF\",C526=\"WHP\"),LOOKUP(E526,$S$526:$S$536,$U$526:$U$536),IF(OR(C526=\"SAF\",C526=\"RAF\"),LOOKUP(E526,$S$552:$S$576,$U$552:$U$576),\"\"))","v":""},{"$f":"IFERROR(IF(OR(C526=\"CWP\",C526=\"CTF\"),_xlfn.XLOOKUP(B526,$AB$525:$AB$544,$AD$525:$AD$544),IF(OR(C526=\"HWP\",C526=\"WHP\"),_xlfn.XLOOKUP(B526,$AB$525:$AB$544,$AC$525:$AC$544),IF(OR(C526=\"SAF\",C526=\"RAF\"),_xlfn.XLOOKUP(B526,$AB$550:$AB$569,$AC$550:$AC$569),\"\"))),\"\")","v":""},{"$f":"IFERROR(IF(C526=\"HWP\",0.249,IF(C526=\"WHP\",0.249,IF(C526=\"CWP\",0.081,IF(C526=\"CTF\",0.502,\"\")))),\"\")","v":""},{"$f":"IFERROR(IF(C526=\"HWP\",0,IF(C526=\"WHP\",0,IF(C526=\"CWP\",0,IF(C526=\"CTF\",0.407,\"\")))),\"\")","v":""},{"$f":"IFERROR(IF(C526=\"HWP\",0.56,IF(C526=\"SAF\",0.56,IF(C526=\"RAF\",0.56,IF(C526=\"WHP\",0,IF(C526=\"CWP\",0,IF(C526=\"CTF\",0,\"\")))))),\"\")","v":""},"","",{"$f":"IF(OR(C526=\"HWP\",C526=\"SAF\",C526=\"RAF\"),E526*65%/F526*J526,\"\")","v":""},null,null,null,null,null,1,2,0.85499999999999998,null,null,null,null,null,null,"Education: College, University",7005,4065]
[null,{"$f":"VFDs!C28","v":0},{"$f":"VFDs!B28","v":0},0,{"$f":"VFDs!E28","v":0},"","",{"$f":"IFERROR(IF(C527=\"HWP\",0.249,IF(C527=\"WHP\",0.249,IF(C527=\"CWP\",0.081,IF(C527=\"CTF\",0.502,\"\")))),\"\")","v":""},{"$f":"IFERROR(IF(C527=\"HWP\",0,IF(C527=\"WHP\",0,IF(C527=\"CWP\",0,IF(C527=\"CTF\",0.407,\"\")))),\"\")","v":""},{"$f":"IFERROR(IF(C527=\"HWP\",0.56,IF(C527=\"SAF\",0.56,IF(C527=\"RAF\",0.56,IF(C527=\"WHP\",0,IF(C527=\"CWP\",0,IF(C527=\"CTF\",0,\"\")))))),\"\")","v":""},"","","",null,null,null,null,null,3,5,0.89500000000000002,null,null,null,null,null,null,"Education: K-12",5754,2895]
[null,{"$f":"VFDs!C29","v":0},{"$f":"VFDs!B29","v":0},0,{"$f":"VFDs!E29","v":0},"","","","","","","","",null,null,null,null,null,7.5,7.5,0.91,null,null,null,null,null,null,"Garage",4849,2102]
[null,{"$f":"VFDs!C30","v":0},{"$f":"VFDs!B30","v":0},0,{"$f":"VFDs!E30","v":0},"","","","","","","","",null,null,null,null,null,10,10,0.91700000000000004,null,null,null,null,null,null,"Grocery",7452,5470]
[null,{"$f":"VFDs!C31","v":0},{"$f":"VFDs!B31","v":0},0,{"$f":"VFDs!E31","v":0},"","","","","","","","",null,null,null,null,null,15,20,0.93,null,null,null,null,null,null,"Health Care: In Patient",4613,6188]
[null,{"$f":"VFDs!C32","v":0},{"$f":"VFDs!B32","v":0},0,{"$f":"VFDs!E32","v":0},"","","","","","","","",null,null,null,null,null,25,25,0.93600000000000005,null,null,null,null,null,null,"Health Care: Out Patient",8760,6364]
[null,{"$f":"VFDs!C33","v":0},{"$f":"VFDs!B33","v":0},0,{"$f":"VFDs!E33","v":0},"","","","","","","","",null,null,null,null,null,30,40,0.94099999999999995,null,null,null,null,null,null,"Lodging: Common areas",6340,6227]
[null,{"$f":"VFDs!C34","v":0},{"$f":"VFDs!B34","v":0},0,{"$f":"VFDs!E34","v":0},"","","","","","","","",null,null,null,null,null,50,50,0.94499999999999995,null,null,null,null,null,null,"Lodging: Rooms",5632,4155]
[null,{"$f":"VFDs!C35","v":0},{"$f":"VFDs!B35","v":0},0,{"$f":"VFDs!E35","v":0},"","","","","","","","",null,null,null,null,null,60,75,0.95,null,null,null,null,null,null,"Manufacturing",3821,2805]
[null,null,null,null,null,null,null,null,null,null,null,null,null,null,null,null,null,null,100,125,0.95399999999999996,null,null,null,null,null,null,"Multifamily housing: Common areas",5590,5910]
[null,null,null,null,null,null,null,null,null,null,null,null,null,null,null,null,null,null,150,200,0.95799999999999996,null,null,null,null,null,null,"Nursing Home",4711,4373]
[null,"SAF","HVAC Supply",null,null,null,null,null,null,null,null,null,null,null,null,null,null,null,null,null,null,null,null,null,null,null,null,"Office",4960,4421]
[null,"RAF","HVAC Return",null,null,null,null,null,null,null,null,null,null,null,null,null,null,null,null,null,null,null,null,null,null,null,null,"Public Assembly",4412,2714]
[null,"CTF","Cooling Tower Fan",null,null,null,null,null,null,null,null,null,null,null,null,null,null,null,null,null,null,null,null,null,null,null,null,"Religious Worship",5199,2830]
[null,"CWP","Chilled Water Pump",null,null,null,null,null,null,null,null,null,null,null,null,null,null,null,null,null,null,null,null,null,null,null,null,"Restaurant",3476,2305]
[null,"HWP","Heat Water Pump",null,null,null,null,null,null,null,null,null,null,null,null,null,null,null,null,null,null,null,null,null,null,null,null,"Retail: Department Store",4249,2528]
[null,"WHP","Water Source Heat Pump Circulator Loop",null,null,null,null,null,null,null,null,null,null,null,null,null,null,null,null,null,null,null,null,null,null,null,null,"Retail: Mall",4475,2266]
[null,null,null,null,null,null,null,null,null,null,null,null,null,null,null,null,null,null,null,null,null,null,null,null,null,null,null,"Warehouse",4606,770]
[null,null,null,null,null,null,null,null,null,null,null,null,null,null,null,null,null,null,null,null,null,null,null,null,null,null,null,"Miscellaneous/Other/Unknown",5078,2105]
[]
[null,null,null,null,null,null,null,null,null,null,null,null,null,null,null,null,null,null,"Dominion Energy South Carolina\nCommercial Energy Algorithm Manual October 2024 PY15"]
[]
[null,null,null,null,null,null,null,null,null,null,null,null,null,null,null,null,null,null,"NEMA Premium Efficiency Motors default Efficciency"]
[null,null,null,null,null,null,null,null,null,null,null,null,null,null,null,null,null,null,"HP","Open Motors (ODP)",null,null,"Enclosed Motors (TEFC)",null,null,null,null,"Building Type","Total Fan Run Hours"]
[null,null,null,null,null,null,null,null,null,null,null,null,null,null,null,null,null,null,null,"# of Poles",null,null,null,null,null,null,null,"Convenience Store",7004]
[null,null,null,null,null,null,null,null,null,null,null,null,null,null,null,null,null,null,null,6,4,2,6,4,2,null,null,"Education: College, University",4836]
[null,null,null,null,null,null,null,null,null,null,null,null,null,null,null,null,null,null,1,0.82499999999999996,0.85499999999999998,0.77,0.82499999999999996,0.85499999999999998,0.77,null,null,"Education: K-12",3613]
[null,null,null,null,null,null,null,null,null,null,null,null,null,null,null,null,null,null,1.5,0.86499999999999999,0.86499999999999999,0.84,0.875,0.86499999999999999,0.84,null,null,"Garage",7357]
[null,null,null,null,null,null,null,null,null,null,null,null,null,null,null,null,null,null,2,0.875,0.86499999999999999,0.85499999999999998,0.88500000000000001,0.86499999999999999,0.85499999999999998,null,null,"Grocery",8543]
[null,null,null,null,null,null,null,null,null,null,null,null,null,null,null,null,null,null,3,0.88500000000000001,0.89500000000000002,0.85499999999999998,0.89500000000000002,0.89500000000000002,0.86499999999999999,null,null,"Health Care: In Patient",6167]
[null,null,null,null,null,null,null,null,null,null,null,null,null,null,null,null,null,null,5,0.89500000000000002,0.89500000000000002,0.86499999999999999,0.89500000000000002,0.89500000000000002,0.88500000000000001,null,null,"Health Care: Out Patient",4314]
[null,null,null,null,null,null,null,null,null,null,null,null,null,null,null,null,null,null,7.5,0.90200000000000002,0.91,0.88500000000000001,0.91,0.91700000000000004,0.89500000000000002,null,null,"Lodging: Common areas",8683]
[null,null,null,null,null,null,null,null,null,null,null,null,null,null,null,null,null,null,10,0.91700000000000004,0.91700000000000004,0.89500000000000002,0.91,0.91700000000000004,0.90200000000000002,null,null,"Lodging: Rooms",2409]
[null,null,null,null,null,null,null,null,null,null,null,null,null,null,null,null,null,null,15,0.91700000000000004,0.93,0.90200000000000002,0.91700000000000004,0.92400000000000004,0.91,null,null,"Manufacturing",8706]
[null,null,null,null,null,null,null,null,null,null,null,null,null,null,null,null,null,null,20,0.92400000000000004,0.93,0.91,0.91700000000000004,0.93,0.91,null,null,"Miscellaneous/Other/Unknown",7088]
[null,null,null,null,null,null,null,null,null,null,null,null,null,null,null,null,null,null,25,0.93,0.93599999999999994,0.91700000000000004,0.93,0.93599999999999994,0.91700000000000004,null,null,"Multifamily housing: Common areas",8760]
[null,null,null,null,null,null,null,null,null,null,null,null,null,null,null,null,null,null,30,0.93599999999999994,0.94099999999999995,0.91700000000000004,0.93,0.93599999999999994,0.91700000000000004,null,null,"Nursing Home",8760]
[null,null,null,null,null,null,null,null,null,null,null,null,null,null,null,null,null,null,40,0.94099999999999995,0.94099999999999995,0.92400000000000004,0.94099999999999995,0.94099999999999995,0.92400000000000004,null,null,"Office",3564]
[null,null,null,null,null,null,null,null,null,null,null,null,null,null,null,null,null,null,50,0.94099999999999995,0.94499999999999995,0.93,0.94099999999999995,0.94499999999999995,0.93,null,null,"Public Assembly",7998]
[null,null,null,null,null,null,null,null,null,null,null,null,null,null,null,null,null,null,60,0.94499999999999995,0.95,0.93599999999999994,0.94499999999999995,0.95,0.93599999999999994,null,null,"Religious Worship",7380]
[null,null,null,null,null,null,null,null,null,null,null,null,null,null,null,null,null,null,75,0.94499999999999995,0.95,0.93599999999999994,0.94499999999999995,0.95400000000000007,0.93599999999999994,null,null,"Restaurant",7302]
[null,null,null,null,null,null,null,null,null,null,null,null,null,null,null,null,null,null,100,0.95,0.95400000000000007,0.93599999999999994,0.95,0.95400000000000007,0.94099999999999995,null,null,"Retail: Department Store",7155]
[null,null,null,null,null,null,null,null,null,null,null,null,null,null,null,null,null,null,125,0.95,0.95400000000000007,0.94099999999999995,0.95,0.95400000000000007,0.95,null,null,"Retail: Mall",6921]
[null,null,null,null,null,null,null,null,null,null,null,null,null,null,null,null,null,null,150,0.95400000000000007,0.95799999999999996,0.94099999999999995,0.95799999999999996,0.95799999999999996,0.95,null,null,"Warehouse",6832]
[null,null,null,null,null,null,null,null,null,null,null,null,null,null,null,null,null,null,200,0.95400000000000007,0.95799999999999996,0.95,0.95799999999999996,0.96200000000000008,0.95400000000000007]
[null,null,null,null,null,null,null,null,null,null,null,null,null,null,null,null,null,null,250,0.95399999999999996,0.95799999999999996,0.95,0.95799999999999996,0.96199999999999997,0.95799999999999996]
[null,null,null,null,null,null,null,null,null,null,null,null,null,null,null,null,null,null,300,0.95399999999999996,0.95799999999999996,0.95399999999999996,0.95799999999999996,0.96199999999999997,0.95799999999999996]
[null,null,null,null,null,null,null,null,null,null,null,null,null,null,null,null,null,null,350,0.95399999999999996,0.95799999999999996,0.95399999999999996,0.95799999999999996,0.96199999999999997,0.95799999999999996]
[null,null,null,null,null,null,null,null,null,null,null,null,null,null,null,null,null,null,400,0.95799999999999996,0.95799999999999996,0.95799999999999996,0.95799999999999996,0.96199999999999997,0.95799999999999996]
[null,null,null,null,null,null,null,null,null,null,null,null,null,null,null,null,null,null,450,0.96199999999999997,0.96199999999999997,0.95799999999999996,0.95799999999999996,0.96199999999999997,0.95799999999999996]
[null,null,null,null,null,null,null,null,null,null,null,null,null,null,null,null,null,null,500,0.96199999999999997,0.96199999999999997,0.95799999999999996,0.95799999999999996,0.96199999999999997,0.95799999999999996]
[]
[null,"Chiller Calculations"]
[]
[null,"Building Type","EFLHCOOL",null,null,null,"Electric Energy Savings"]
[null,null,"Charleston","Columbia","Average",null,"kWh = Capacity * (IPLVbase – IPLVee) * EFLHcool"]
[null,"Assembly",3141,2888,3015,null,"Where:"]
[null,"Education",1694,1558,1626,null,"Capacity","= Chiller nominal cooling capacity in tons (1 ton = 12,000 Btu/hr). From application."]
[null,"Garage",2340,2151,2245,null,"IPLVbase","= Integrated Part Load Value (IPLV) (kW/ton) of the baseline equipment"]
[null,"Grocery",1966,1807,1886]
[null,"Health",3285,3021,3153,null,"Summer Coincident Peak Demand Savings"]
[null,"Industrial",2149,1976,2062,null,"ΔkW = (Capacity) * (PEbase - PEee) * CF"]
[null,"Lodging",2311,2125,2218,null,"Where:"]
[null,"Multi-Family",1960,1802,1881,null,"PEbase","Peak efficiency of baseline equipment expressed as full load (kW/ton)"]
[null,"Office",3056,2810,2933,null,"PEee"," Peak efficiency of efficient equipment expressed as full load (kW/ton)"]
[null,"Retail",1430,1315,1373,null,"CF","= Summer peak coincidence factor. Assume 0.8.[1]"]
[null,"Warehouse",558,513,535]
[null,"Other",2068,1901,1985,null,"please note if Air cooled unit is selected kWh = ((12/IPLVb)-  (12/IPLVp))* Tons *EFLH."]
[null,"Unknown",2075,1908,1991]

{"sheet":"Program Info Tables","index":13,"n_rows":28,"n_cols":19,"rows_kept":28,"cut":false,"hidden":true,"merged":[]}
[null,"Program Info Tables For Chiller"]
[null,"Full Load Efficiencies (EER for Air Cooled) (Single Speed)",null,null,null,null,null,"Full Load Efficiencies (EER for Air Cooled) (VFD Controlled)",null,null,null,null,null,null,"Baseline Full Load Efficiencies (EER for Air Cooled) (Single Speed and VFD)"]
[null,"Tonnage Under","ACC","WCSC","WCRC","WCCC",null,"Tonnage Under","ACC","WCSC","WCRC","WCCC",null,null,"Tonnage Under","ACC","WCSC","WCRC","WCCC"]
[null,150,10.199999999999999,0.71,0.71,0.59,null,150,10.199999999999999,0.73,0.73,0.59,null,null,150,{"$f":"12/1.256","v":9.5541401273885356},0.79,0.83699999999999997,0.70299999999999996]
[null,300,10.199999999999999,0.57999999999999996,0.57999999999999996,0.59,null,300,10.199999999999999,0.61,0.61,0.59,null,null,300,{"$f":"12/1.256","v":9.5541401273885356},0.71799999999999997,0.83699999999999997,0.63400000000000001]
[null,600,10.199999999999999,0.56000000000000005,0.56000000000000005,0.56000000000000005,null,600,10.199999999999999,0.57999999999999996,0.57999999999999996,0.57999999999999996,null,null,600,{"$f":"12/1.256","v":9.5541401273885356},0.63900000000000001,0.83699999999999997,0.57699999999999996]
[null,10000,10.199999999999999,0.56000000000000005,0.56000000000000005,0.55000000000000004,null,10000,10.199999999999999,0.57999999999999996,0.57999999999999996,0.56999999999999995,null,null,10000,9.5541401273885356,0.63900000000000001,0.83699999999999997,0.57699999999999996]
[]
[null,"IPLV Efficiencies (Single Speed)",null,null,null,null,null,"IPLV Efficiencies (VFD Controlled)",null,null,null,null,null,null,"Baseline IPLV Efficiencies (EER for Air Cooled) (Single Speed and VFD)"]
[null,"Tonnage Under","ACC","WCSC","WCRC","WCCC",null,"Tonnage Under","ACC","WCSC","WCRC","WCCC",null,null,"Tonnage Under","ACC","WCSC","WCRC","WCCC"]
[null,150,13.34,0.56000000000000005,0.56000000000000005,0.56000000000000005,null,150,13.36,0.54,0.54,0.42,null,null,150,{"$f":"12/1.153","v":10.407632263660018},0.67600000000000005,0.69599999999999995,0.67]
[null,300,13.6,0.47,0.47,0.56000000000000005,null,300,13.8,0.44,0.44,0.42,null,null,300,{"$f":"12/1.153","v":10.407632263660018},0.628,0.69599999999999995,0.59599999999999997]
[null,600,13.6,0.45,0.45,0.53,null,600,13.8,0.44,0.44,0.38,null,null,600,10.407632263660018,0.57199999999999995,0.69599999999999995,0.55000000000000004]
[null,10000,13.6,0.45,0.45,0.52,null,10000,13.8,0.44,0.44,0.38,null,null,10000,10.407632263660018,0.57199999999999995,0.69599999999999995,0.55000000000000004]
[]
[null,"Chiller Incentives (Base) ($/ton) (Single Speed)",null,null,null,null,null,"Chiller Incentives (Base) ($/ton) (VFD Controlled)"]
[null,"Tonnage Under","ACC","WCSC","WCRC","WCCC",null,"Tonnage Under","ACC","WCSC","WCRC","WCCC"]
[null,150,20,35,35,20,null,150,10,20,20,10]
[null,300,20,35,35,20,null,300,10,15,15,10]
[null,600,20,25,25,20,null,600,10,10,10,10]
[null,10000,20,25,25,20,null,10000,10,10,10,10]
[]
[null,"Chiller Incentives (Performance) ($/ton) (Single Speed)",null,null,null,null,null,"Chiller Incentives (Performance) ($/ton) (VFD Controlled)"]
[null,"Tonnage Under","ACC","WCSC","WCRC","WCCC",null,"Tonnage Under","ACC","WCSC","WCRC","WCCC"]
[null,150,3,4,4,3,null,150,4,6,6,5]
[null,300,3,3,3,3,null,300,4,6,6,5]
[null,600,3,2,2,3,null,600,4,3,3,4]
[null,10000,3,2,2,2,null,10000,4,3,3,3]

{"sheet":"VFDs","index":14,"n_rows":38,"n_cols":18,"rows_kept":38,"cut":false,"hidden":false,"merged":[[6,1,6,10],[3,1,3,10],[7,1,7,10],[0,1,0,10],[1,1,1,10],[2,1,2,10],[4,1,4,10],[5,1,5,10],[23,1,23,10],[8,1,8,10],[14,1,14,10],[19,1,19,10],[16,3,16,4],[17,3,17,4],[21,3,21,4],[10,6,10,7],[11,6,11,7],[12,6,12,7],[16,5,16,7],[17,5,17,7],[21,5,21,6],[38,19,38,20],[33,9,33,10],[34,9,34,10],[24,9,24,10],[25,9,25,10],[26,9,26,10],[27,9,27,10],[28,9,28,10],[35,1,35,8],[35,9,35,10],[29,9,29,10],[30,9,30,10],[31,9,31,10],[32,9,32,10]]}
[null,"Fill in Blue Cells Only!"]
[null,"HVAC VARIABLE FREQUENCY DRIVES TECHNICAL REQUIREMENTS"]
[null,"Replacement of failed VFDs or those installed in new construction do not qualify for incentives. Only VFD installations not required by South Carolina Code IECC 2009 are eligible for incentives.  Incentives will be provided for the installation of new VFDs controlled by an automatic signal in response to varying air or water flow. Types of VFD installation are listed in Table 1. Incentives will be for VFDs from .25–100 horsepower (HP) for the HVAC applications listed in Table 2. Table 3 shows the controlling parameters for the VFDs.\n\nFor chilled water and heating pump installations, at least 75 percent of pump capacity must be controlled by two-way valves. Controlled motors must operate a minimum of 2,000 hours per year.\n\nThe following HVAC VFD applications are NOT eligible for these incentives:\n▪ Forward curve fans with inlet guide vanes\n▪ Variable pitch vane-axial fans\n▪ Replacement of a failed VFD\n▪ VFD used solely for balancing a constant flow\n▪ Control of existing two-speed cooling tower fan\n▪ Two-speed control of a fan or pump\n▪ Mitigation of oversized motor installation"]
[null,"Published manufacturer’s information must be submitted with each application to demonstrate compliance for each of the following criteria:\n▪ 15 millisecond minimum ride through on the VFD control at full load and no inertia\n▪ Auto restart\n▪ Flying restart (start into rotating motor, speed search)\n▪ Under voltage trip 85 percent or less\n▪ Minimum 3 percent in-line reactor or equivalent (choke, isolation transformer) based on drive HP\n▪ 95 percent minimum drive efficiency at full load and full speed\n▪ 0.95 minimum displacement power factor"]
[]
[null,"IMPORTANT INFORMATION ABOUT VFDs"]
[null,"▪ It is good engineering practice to ensure that the application of VFDs within a facility does not cause excessive facility harmonic distortion.\n▪ If the cable length between a VFD and controlled motor is greater than 50 feet, additional motor winding insulation on the first few windings, or the installation of an LC filter on the output of the inverter, might be required.\n▪ The VFD should be grounded in accordance with the manufacturer’s grounding requirements for noise, as long as the requirement complies with applicable electric codes.\n▪ The facility owner might want to consider: VFD startup by manufacturer representative, overcurrent trip protection, and critical frequency lockout.\nSee IEEE 519 for further information."]
[]
[null,"Table 1:  VFD Installation Type"]
[]
[null,null,null,"SAF =","HVAC Supply","CWP =","Chilled Water Pump"]
[null,null,null,"RAF =","HVAC Return","HWP =","Heat Water Pump"]
[null,null,null,"CTF =","Cooling Tower Fan","WHP =","Water Source Heat Pump Circulator Loop"]
[]
[null,"Table 2: VFD Size and Incentive "]
[]
[null,null,null,75,null,"when Horse Power is 0.25 - 1.00"]
[null,null,null,50,null,"/ HP when Horse Power is greater than 1.00"]
[]
[null,"Table 3: Controlling Parameters"]
[]
[null,null,null,"DP = Differential Pressure",null,"DT = Differential Temperature",null,"Other: (Specify)  "]
[]
[null,"Variable Frequency Drives"]
[null,"Installation Type \n(Table 1 above)","Building Type","Manufacturer / Model","VFD & Motor Horsepower (Table 2 above)","Controlling Parameter (Table 3 above)","Other","Quantity","Location/Designation","Requested Incentive ",null,null,null,null,"Electric Energy Savings (kWh)","Demand Savings Summer(kW)","Demand Savings Winter(kW)","Incentive Per Unit"]
[]
[null,null,null,null,null,null,null,null,null,{"$f":"IF(E27=\"\",\"\",IF(E27<=1,75*H27,50*E27*H27))","v":""},null,null,null,null,{"$f":"Validation!K526","v":""},{"$f":"Validation!L526","v":""},{"$f":"Validation!M526","v":""},{"$f":"IFERROR(J27/H27,0)","v":0}]
[null,null,null,null,null,null,null,null,null,"",null,null,null,null,{"$f":"Validation!K527","v":""},{"$f":"Validation!L527","v":""},{"$f":"Validation!M527","v":""},0]
[null,null,null,null,null,null,null,null,null,"",null,null,null,null,{"$f":"Validation!K528","v":""},{"$f":"Validation!L528","v":""},{"$f":"Validation!M528","v":""},0]
[null,null,null,null,null,null,null,null,null,"",null,null,null,null,{"$f":"Validation!K529","v":""},{"$f":"Validation!L529","v":""},{"$f":"Validation!M529","v":""},0]
[null,null,null,null,null,null,null,null,null,"",null,null,null,null,{"$f":"Validation!K530","v":""},{"$f":"Validation!L530","v":""},{"$f":"Validation!M530","v":""},0]
[null,null,null,null,null,null,null,null,null,"",null,null,null,null,{"$f":"Validation!K531","v":""},{"$f":"Validation!L531","v":""},{"$f":"Validation!M531","v":""},0]
[null,null,null,null,null,null,null,null,null,"",null,null,null,null,{"$f":"Validation!K532","v":""},{"$f":"Validation!L532","v":""},{"$f":"Validation!M532","v":""},0]
[null,null,null,null,null,null,null,null,null,"",null,null,null,null,{"$f":"Validation!K533","v":""},{"$f":"Validation!L533","v":""},{"$f":"Validation!M533","v":""},0]
[null,null,null,null,null,null,null,null,null,"",null,null,null,null,{"$f":"Validation!K534","v":""},{"$f":"Validation!L534","v":""},{"$f":"Validation!M534","v":""},0]
[null,"Total Requested Incentive",null,null,null,null,null,null,null,{"$f":"SUM(J26:K35)","v":0},null,null,null,null,{"$f":"SUM(O26:O35)","v":0},{"$f":"SUM(P26:P35)","v":0},{"$f":"Validation!M535","v":0},0]
[]
[null,null,null,null,null,null,null,null,null,null,{"$f":"\"Version \"  &  'Version Tracking'!C4","v":"Version 15.2"}]

{"sheet":"HPWH","index":15,"n_rows":23,"n_cols":21,"rows_kept":23,"cut":false,"hidden":false,"merged":[[19,0,19,12],[0,0,0,13],[2,0,2,13],[3,0,5,13],[6,0,6,13],[7,8,7,9]]}
["Fill in Blue Cells Only!"]
[]
["HEAT PUMP WATER HEATER (HPWH) TECHNICAL REQUIREMENTS AND INCENTIVES"]
["TECHNICAL REQUIREMENTS\n• Light commercial Heat Pump Water Heater (HPWH) must meet ENERGY STAR v5.0 specifications. Minimum efficiency requirements are listed below as well as an eligible product list: \n                o Integrated HPWH - 240 Volt: Units are rated in UEF and have a minimum requirement of 3.30 to qualify.\n                o Integrated HPWH - 120 Volt: Units are rated in UEF and have a minimum requirement of 2.20 to qualify.\n                o Split-system HPWH: Units are rated in UEF and have a minimum requirement of 2.20 to qualify.\n• All HPWH must be 20 gallons or larger storage capacity up to 120 gallons storage capacity to qualify.\n• Is not designed to provide outlet hot water at temperatures greater than 180 °F\n• Commercial HPWH rated in COP are not allowed through this prescriptive offering. Please reach out to your program team to inquire about the Custom program for these units.\n\nWORKBOOK INSTRUCTIONS\n• All blue fields below for a HPWH must be filled in to qualify on a given row.\n• For a HPWH installed in a conditioned space, enter Heating and Cooling System Type. This is not needed if installed in an unconditioned space."]
[]
[]
["Light Commercial HPWH ENERGY STAR v5.0 eligible product list: https://www.energystar.gov/productfinder/product/certified-heat-pump-water-heaters/results"]
[null,null,null,null,null,null,null,null,"If water heater will be located in a conditioned space, specify HVAC type"]
["Building Type","Device Type","Manufacturer","Model #","HPWH Capacity (Gallons)","UEF","First Hour Rating (FHR)","Water Heater Location","Heating System","Cooling System","Quantity","Incentive Rate","Qualifies","Total Incentive",null,null,null,"Incentive Per unit","kWh","Winter kW","Total Incentive"]
[null,null,null,null,null,null,null,null,null,null,null,{"$f":"\"$\"&'HPWH Validation'!$A$1&\"/unit\"","v":"$500/unit"},{"$f":"'HPWH Calcs'!P9","v":""},{"$f":"U10","v":0},null,null,null,{"$f":"IFERROR(U10/K10,0)","v":0},{"$f":"'HPWH Calcs'!AJ9","v":0},{"$f":"'HPWH Calcs'!AK9","v":0},{"$f":"'HPWH Calcs'!AO9","v":0}]
[null,null,null,null,null,null,null,null,null,null,null,{"$f":"\"$\"&'HPWH Validation'!$A$1&\"/unit\"","v":"$500/unit"},{"$f":"'HPWH Calcs'!P10","v":""},0,null,null,null,{"$f":"IFERROR(U11/K11,0)","v":0},{"$f":"'HPWH Calcs'!AJ10","v":0},{"$f":"'HPWH Calcs'!AK10","v":0},{"$f":"'HPWH Calcs'!AO10","v":0}]
[null,null,null,null,null,null,null,null,null,null,null,{"$f":"\"$\"&'HPWH Validation'!$A$1&\"/unit\"","v":"$500/unit"},{"$f":"'HPWH Calcs'!P11","v":""},0,null,null,null,0,{"$f":"'HPWH Calcs'!AJ11","v":0},{"$f":"'HPWH Calcs'!AK11","v":0},{"$f":"'HPWH Calcs'!AO11","v":0}]
[null,null,null,null,null,null,null,null,null,null,null,{"$f":"\"$\"&'HPWH Validation'!$A$1&\"/unit\"","v":"$500/unit"},{"$f":"'HPWH Calcs'!P12","v":""},0,null,null,null,0,{"$f":"'HPWH Calcs'!AJ12","v":0},{"$f":"'HPWH Calcs'!AK12","v":0},{"$f":"'HPWH Calcs'!AO12","v":0}]
[null,null,null,null,null,null,null,null,null,null,null,{"$f":"\"$\"&'HPWH Validation'!$A$1&\"/unit\"","v":"$500/unit"},{"$f":"'HPWH Calcs'!P13","v":""},0,null,null,null,0,{"$f":"'HPWH Calcs'!AJ13","v":0},{"$f":"'HPWH Calcs'!AK13","v":0},{"$f":"'HPWH Calcs'!AO13","v":0}]
[null,null,null,null,null,null,null,null,null,null,null,{"$f":"\"$\"&'HPWH Validation'!$A$1&\"/unit\"","v":"$500/unit"},{"$f":"'HPWH Calcs'!P14","v":""},0,null,null,null,0,{"$f":"'HPWH Calcs'!AJ14","v":0},{"$f":"'HPWH Calcs'!AK14","v":0},{"$f":"'HPWH Calcs'!AO14","v":0}]
[null,null,null,null,null,null,null,null,null,null,null,{"$f":"\"$\"&'HPWH Validation'!$A$1&\"/unit\"","v":"$500/unit"},{"$f":"'HPWH Calcs'!P15","v":""},0,null,null,null,0,{"$f":"'HPWH Calcs'!AJ15","v":0},{"$f":"'HPWH Calcs'!AK15","v":0},{"$f":"'HPWH Calcs'!AO15","v":0}]
[null,null,null,null,null,null,null,null,null,null,null,{"$f":"\"$\"&'HPWH Validation'!$A$1&\"/unit\"","v":"$500/unit"},{"$f":"'HPWH Calcs'!P16","v":""},0,null,null,null,0,{"$f":"'HPWH Calcs'!AJ16","v":0},{"$f":"'HPWH Calcs'!AK16","v":0},{"$f":"'HPWH Calcs'!AO16","v":0}]
[null,null,null,null,null,null,null,null,null,null,null,{"$f":"\"$\"&'HPWH Validation'!$A$1&\"/unit\"","v":"$500/unit"},{"$f":"'HPWH Calcs'!P17","v":""},0,null,null,null,0,{"$f":"'HPWH Calcs'!AJ17","v":0},{"$f":"'HPWH Calcs'!AK17","v":0},{"$f":"'HPWH Calcs'!AO17","v":0}]
[null,null,null,null,null,null,null,null,null,null,null,{"$f":"\"$\"&'HPWH Validation'!$A$1&\"/unit\"","v":"$500/unit"},{"$f":"'HPWH Calcs'!P18","v":""},0,null,null,null,0,{"$f":"'HPWH Calcs'!AJ18","v":0},{"$f":"'HPWH Calcs'!AK18","v":0},{"$f":"'HPWH Calcs'!AO18","v":0}]
["Total Requested Incentive",null,null,null,null,null,null,null,null,null,null,null,null,{"$f":"SUM(N10:N19)","v":0}]
[null,null,null,null,null,null,null,null,null,null,null,"Error Messages:"]
[null,null,null,null,null,null,null,null,null,null,1,{"$f":"_xlfn.XLOOKUP(K22,'HPWH Validation'!$A$29:$A$31,'HPWH Validation'!$C$29:$C$31)","v":"No. Please fill in all blue cells."},null,{"$f":"\"Version \"  &  'Version Tracking'!C4","v":"Version 15.2"}]
[null,null,null,null,null,null,null,null,null,null,2,{"$f":"_xlfn.XLOOKUP(K23,'HPWH Validation'!$A$29:$A$31,'HPWH Validation'!$C$29:$C$31)","v":"No. Efficiency doesn't meet minimum requirements."}]

{"sheet":"HPWH Calcs","index":16,"n_rows":18,"n_cols":43,"rows_kept":18,"cut":false,"hidden":true,"merged":[[5,12,5,13],[6,0,6,10],[6,21,6,23],[6,35,6,37],[6,38,6,40]]}
[]
[]
[]
[]
[]
[null,null,null,null,null,null,null,null,null,null,null,null,"Error Message"]
["Inputs",null,null,null,null,null,null,null,null,null,null,null,1,2,null,null,null,null,null,null,null,"UEF as mx+b, x = volume",null,null,null,null,null,null,null,null,null,null,null,null,null,"Per Unit",null,null,"Totals"]
["Building Type","Device Type","Manufacturer","Model Number","Volume of tank","UEFpost","FHR","Water Heater Location","Conditioned Space Heating Type","Conditioned Space Cooling Type","Quantity","Qualifying UEF","All blue cells filled in?","Unit meets efficiency requirement?","Result","Qualifies","ρ","Cp","Tout","Tin","Draw Pattern","UEF m value","UEF b value","UEFbase","Consumption/cap","Annual Consumption","LF_conditioned space","COPcool_HP","COPheat_HP","%natural Gas","LM","HPWHWasteheatcool","HPWHWasteheatheat","DHWsavings","Winter CF","kWh Savings per Unit","Winter kW Savings per Unit","Incentive per Unit","kWh Savings per Unit","Winter kW Savings per Unit","Total Incentive",null,"$/kWh"]
[{"$f":"HPWH!A10","v":0},{"$f":"HPWH!B10","v":0},{"$f":"HPWH!C10","v":0},{"$f":"HPWH!D10","v":0},{"$f":"HPWH!E10","v":0},{"$f":"HPWH!F10","v":0},{"$f":"HPWH!G10","v":0},{"$f":"HPWH!H10","v":0},{"$f":"HPWH!I10","v":0},{"$f":"HPWH!J10","v":0},{"$f":"HPWH!K10","v":0},{"$f":"_xlfn.XLOOKUP(B9,'HPWH Validation'!$A$23:$A$25,'HPWH Validation'!$B$23:$B$25)","v":{"$error":"#N/A"}},{"$f":"IF(AND(A9<>0,B9<>0,C9<>0,D9<>0,E9<>0,F9<>0,G9<>0,H9<>0,K9<>0),\"Yes\",\"No\")","v":"No"},{"$f":"IF(F9>=L9,\"Yes\",\"No\")","v":{"$error":"#N/A"}},{"$f":"IF(M9=\"Yes\",IF(N9=\"Yes\",0,$N$7),$M$7)","v":1},{"$f":"IF(SUM(A9:H9,K9)=0,\"\",_xlfn.XLOOKUP(O9,'HPWH Validation'!$A$29:$A$31,'HPWH Validation'!$B$29:$B$31))","v":""},8.33,1,125,{"$f":"'HPWH Validation'!$O$10","v":69.400000000000006},{"$f":"VLOOKUP(G9,'HPWH Validation'!$B$5:$D$8,3)","v":"Very Small"},{"$f":"_xlfn.XLOOKUP(U9,IF(E9<=55,'HPWH Validation'!$B$12:$B$15,'HPWH Validation'!$B$16:$B$19),IF(E9<=55,'HPWH Validation'!$E$12:$E$15,'HPWH Validation'!$E$16:$E$19))","v":-8.0000000000000004E-4},{"$f":"_xlfn.XLOOKUP(U9,IF(E9<=55,'HPWH Validation'!$B$12:$B$15,'HPWH Validation'!$B$16:$B$19),IF(E9<=55,'HPWH Validation'!$F$12:$F$15,'HPWH Validation'!$F$16:$F$19))","v":0.88080000000000003},{"$f":"V9*E9+W9","v":0.88080000000000003},{"$f":"_xlfn.XLOOKUP(A9,HPWHBldgList,'HPWH Validation'!$L$4:$L$17)","v":{"$error":"#N/A"}},{"$f":"E9*Y9","v":{"$error":"#N/A"}},{"$f":"IF(H9=\"Conditioned Space\",1,0)","v":0},3.08,{"$f":"_xlfn.XLOOKUP(I9,'HPWH Validation'!$P$4:$P$5,'HPWH Validation'!$Q$4:$Q$5)","v":{"$error":"#N/A"}},0,1.33,{"$f":"IF(J9=\"A/C\",((((S9-T9)*Z9*Q9*R9*(1-1/F9))*AA9*25%*AE9)/(AB9*3412))*1,0)","v":0},{"$f":"IF(OR(I9=\"Electric Resistance Heat\",I9=\"Heat Pump\"),((((S9-T9)*Z9*Q9*R9*(1-1/F9))*AA9*35%)/(AC9*3412))*1,0)","v":0},{"$f":"((S9-T9)*Z9*Q9*R9*(1/X9-1/F9))/3412","v":{"$error":"#N/A"}},{"$f":"0.53","v":0.53},{"$f":"IF($P9=\"Yes\",AH9-AG9+AF9,0)","v":0},{"$f":"AJ9/6461*AI9","v":0},{"$f":"'HPWH Validation'!$A$1","v":500},{"$f":"IF($P9=\"Yes\",$K9*AJ9,0)","v":0},0,{"$f":"IF($P9=\"Yes\",$K9*AL9,0)","v":0},null,{"$f":"IFERROR(AO9/AM9,\"\")","v":""}]
[{"$f":"HPWH!A11","v":0},{"$f":"HPWH!B11","v":0},{"$f":"HPWH!C11","v":0},{"$f":"HPWH!D11","v":0},{"$f":"HPWH!E11","v":0},{"$f":"HPWH!F11","v":0},{"$f":"HPWH!G11","v":0},{"$f":"HPWH!H11","v":0},{"$f":"HPWH!I11","v":0},{"$f":"HPWH!J11","v":0},{"$f":"HPWH!K11","v":0},{"$f":"_xlfn.XLOOKUP(B10,'HPWH Validation'!$A$23:$A$25,'HPWH Validation'!$B$23:$B$25)","v":{"$error":"#N/A"}},{"$f":"IF(AND(A10<>0,B10<>0,C10<>0,D10<>0,E10<>0,F10<>0,G10<>0,H10<>0,K10<>0),\"Yes\",\"No\")","v":"No"},{"$f":"IF(F10>=L10,\"Yes\",\"No\")","v":{"$error":"#N/A"}},{"$f":"IF(M10=\"Yes\",IF(N10=\"Yes\",0,$N$7),$M$7)","v":1},{"$f":"IF(SUM(A10:H10,K10)=0,\"\",_xlfn.XLOOKUP(O10,'HPWH Validation'!$A$29:$A$31,'HPWH Validation'!$B$29:$B$31))","v":""},8.33,1,125,{"$f":"'HPWH Validation'!$O$10","v":69.400000000000006},{"$f":"VLOOKUP(G10,'HPWH Validation'!$B$5:$D$8,3)","v":"Very Small"},{"$f":"_xlfn.XLOOKUP(U10,IF(E10<=55,'HPWH Validation'!$B$12:$B$15,'HPWH Validation'!$B$16:$B$19),IF(E10<=55,'HPWH Validation'!$E$12:$E$15,'HPWH Validation'!$E$16:$E$19))","v":-8.0000000000000004E-4},{"$f":"_xlfn.XLOOKUP(U10,IF(E10<=55,'HPWH Validation'!$B$12:$B$15,'HPWH Validation'!$B$16:$B$19),IF(E10<=55,'HPWH Validation'!$F$12:$F$15,'HPWH Validation'!$F$16:$F$19))","v":0.88080000000000003},{"$f":"V10*E10+W10","v":0.88080000000000003},{"$f":"_xlfn.XLOOKUP(A10,HPWHBldgList,'HPWH Validation'!$L$4:$L$17)","v":{"$error":"#N/A"}},{"$error":"#N/A"},0,3.08,{"$f":"_xlfn.XLOOKUP(I10,'HPWH Validation'!$P$4:$P$5,'HPWH Validation'!$Q$4:$Q$5)","v":{"$error":"#N/A"}},0,1.33,{"$f":"IF(J10=\"A/C\",((((S10-T10)*Z10*Q10*R10*(1-1/F10))*AA10*25%*AE10)/(AB10*3412))*1,0)","v":0},{"$f":"IF(OR(I10=\"Electric Resistance Heat\",I10=\"Heat Pump\"),((((S10-T10)*Z10*Q10*R10*(1-1/F10))*AA10*35%)/(AC10*3412))*1,0)","v":0},{"$error":"#N/A"},{"$f":"0.53","v":0.53},{"$f":"IF($P10=\"Yes\",AH10-AG10+AF10,0)","v":0},0,{"$f":"'HPWH Validation'!$A$1","v":500},0,0,{"$f":"IF($P10=\"Yes\",$K10*AL10,0)","v":0},null,{"$f":"IFERROR(AO10/AM10,\"\")","v":""}]
[{"$f":"HPWH!A12","v":0},{"$f":"HPWH!B12","v":0},{"$f":"HPWH!C12","v":0},{"$f":"HPWH!D12","v":0},{"$f":"HPWH!E12","v":0},{"$f":"HPWH!F12","v":0},{"$f":"HPWH!G12","v":0},{"$f":"HPWH!H12","v":0},{"$f":"HPWH!I12","v":0},{"$f":"HPWH!J12","v":0},{"$f":"HPWH!K12","v":0},{"$f":"_xlfn.XLOOKUP(B11,'HPWH Validation'!$A$23:$A$25,'HPWH Validation'!$B$23:$B$25)","v":{"$error":"#N/A"}},"No",{"$error":"#N/A"},1,{"$f":"IF(SUM(A11:H11,K11)=0,\"\",_xlfn.XLOOKUP(O11,'HPWH Validation'!$A$29:$A$31,'HPWH Validation'!$B$29:$B$31))","v":""},8.33,1,125,{"$f":"'HPWH Validation'!$O$10","v":69.400000000000006},{"$f":"VLOOKUP(G11,'HPWH Validation'!$B$5:$D$8,3)","v":"Very Small"},{"$f":"_xlfn.XLOOKUP(U11,IF(E11<=55,'HPWH Validation'!$B$12:$B$15,'HPWH Validation'!$B$16:$B$19),IF(E11<=55,'HPWH Validation'!$E$12:$E$15,'HPWH Validation'!$E$16:$E$19))","v":-8.0000000000000004E-4},{"$f":"_xlfn.XLOOKUP(U11,IF(E11<=55,'HPWH Validation'!$B$12:$B$15,'HPWH Validation'!$B$16:$B$19),IF(E11<=55,'HPWH Validation'!$F$12:$F$15,'HPWH Validation'!$F$16:$F$19))","v":0.88080000000000003},0.88080000000000003,{"$f":"_xlfn.XLOOKUP(A11,HPWHBldgList,'HPWH Validation'!$L$4:$L$17)","v":{"$error":"#N/A"}},{"$error":"#N/A"},0,3.08,{"$f":"_xlfn.XLOOKUP(I11,'HPWH Validation'!$P$4:$P$5,'HPWH Validation'!$Q$4:$Q$5)","v":{"$error":"#N/A"}},0,1.33,0,0,{"$error":"#N/A"},0.53,0,0,{"$f":"'HPWH Validation'!$A$1","v":500},0,0,0,null,""]
[{"$f":"HPWH!A13","v":0},{"$f":"HPWH!B13","v":0},{"$f":"HPWH!C13","v":0},{"$f":"HPWH!D13","v":0},{"$f":"HPWH!E13","v":0},{"$f":"HPWH!F13","v":0},{"$f":"HPWH!G13","v":0},{"$f":"HPWH!H13","v":0},{"$f":"HPWH!I13","v":0},{"$f":"HPWH!J13","v":0},{"$f":"HPWH!K13","v":0},{"$f":"_xlfn.XLOOKUP(B12,'HPWH Validation'!$A$23:$A$25,'HPWH Validation'!$B$23:$B$25)","v":{"$error":"#N/A"}},"No",{"$error":"#N/A"},1,{"$f":"IF(SUM(A12:H12,K12)=0,\"\",_xlfn.XLOOKUP(O12,'HPWH Validation'!$A$29:$A$31,'HPWH Validation'!$B$29:$B$31))","v":""},8.33,1,125,{"$f":"'HPWH Validation'!$O$10","v":69.400000000000006},{"$f":"VLOOKUP(G12,'HPWH Validation'!$B$5:$D$8,3)","v":"Very Small"},{"$f":"_xlfn.XLOOKUP(U12,IF(E12<=55,'HPWH Validation'!$B$12:$B$15,'HPWH Validation'!$B$16:$B$19),IF(E12<=55,'HPWH Validation'!$E$12:$E$15,'HPWH Validation'!$E$16:$E$19))","v":-8.0000000000000004E-4},{"$f":"_xlfn.XLOOKUP(U12,IF(E12<=55,'HPWH Validation'!$B$12:$B$15,'HPWH Validation'!$B$16:$B$19),IF(E12<=55,'HPWH Validation'!$F$12:$F$15,'HPWH Validation'!$F$16:$F$19))","v":0.88080000000000003},0.88080000000000003,{"$f":"_xlfn.XLOOKUP(A12,HPWHBldgList,'HPWH Validation'!$L$4:$L$17)","v":{"$error":"#N/A"}},{"$error":"#N/A"},0,3.08,{"$f":"_xlfn.XLOOKUP(I12,'HPWH Validation'!$P$4:$P$5,'HPWH Validation'!$Q$4:$Q$5)","v":{"$error":"#N/A"}},0,1.33,0,0,{"$error":"#N/A"},0.53,0,0,{"$f":"'HPWH Validation'!$A$1","v":500},0,0,0,null,""]
[{"$f":"HPWH!A14","v":0},{"$f":"HPWH!B14","v":0},{"$f":"HPWH!C14","v":0},{"$f":"HPWH!D14","v":0},{"$f":"HPWH!E14","v":0},{"$f":"HPWH!F14","v":0},{"$f":"HPWH!G14","v":0},{"$f":"HPWH!H14","v":0},{"$f":"HPWH!I14","v":0},{"$f":"HPWH!J14","v":0},{"$f":"HPWH!K14","v":0},{"$f":"_xlfn.XLOOKUP(B13,'HPWH Validation'!$A$23:$A$25,'HPWH Validation'!$B$23:$B$25)","v":{"$error":"#N/A"}},"No",{"$error":"#N/A"},1,{"$f":"IF(SUM(A13:H13,K13)=0,\"\",_xlfn.XLOOKUP(O13,'HPWH Validation'!$A$29:$A$31,'HPWH Validation'!$B$29:$B$31))","v":""},8.33,1,125,{"$f":"'HPWH Validation'!$O$10","v":69.400000000000006},{"$f":"VLOOKUP(G13,'HPWH Validation'!$B$5:$D$8,3)","v":"Very Small"},{"$f":"_xlfn.XLOOKUP(U13,IF(E13<=55,'HPWH Validation'!$B$12:$B$15,'HPWH Validation'!$B$16:$B$19),IF(E13<=55,'HPWH Validation'!$E$12:$E$15,'HPWH Validation'!$E$16:$E$19))","v":-8.0000000000000004E-4},{"$f":"_xlfn.XLOOKUP(U13,IF(E13<=55,'HPWH Validation'!$B$12:$B$15,'HPWH Validation'!$B$16:$B$19),IF(E13<=55,'HPWH Validation'!$F$12:$F$15,'HPWH Validation'!$F$16:$F$19))","v":0.88080000000000003},0.88080000000000003,{"$f":"_xlfn.XLOOKUP(A13,HPWHBldgList,'HPWH Validation'!$L$4:$L$17)","v":{"$error":"#N/A"}},{"$error":"#N/A"},0,3.08,{"$f":"_xlfn.XLOOKUP(I13,'HPWH Validation'!$P$4:$P$5,'HPWH Validation'!$Q$4:$Q$5)","v":{"$error":"#N/A"}},0,1.33,0,0,{"$error":"#N/A"},0.53,0,0,{"$f":"'HPWH Validation'!$A$1","v":500},0,0,0,null,""]
[{"$f":"HPWH!A15","v":0},{"$f":"HPWH!B15","v":0},{"$f":"HPWH!C15","v":0},{"$f":"HPWH!D15","v":0},{"$f":"HPWH!E15","v":0},{"$f":"HPWH!F15","v":0},{"$f":"HPWH!G15","v":0},{"$f":"HPWH!H15","v":0},{"$f":"HPWH!I15","v":0},{"$f":"HPWH!J15","v":0},{"$f":"HPWH!K15","v":0},{"$f":"_xlfn.XLOOKUP(B14,'HPWH Validation'!$A$23:$A$25,'HPWH Validation'!$B$23:$B$25)","v":{"$error":"#N/A"}},"No",{"$error":"#N/A"},1,{"$f":"IF(SUM(A14:H14,K14)=0,\"\",_xlfn.XLOOKUP(O14,'HPWH Validation'!$A$29:$A$31,'HPWH Validation'!$B$29:$B$31))","v":""},8.33,1,125,{"$f":"'HPWH Validation'!$O$10","v":69.400000000000006},{"$f":"VLOOKUP(G14,'HPWH Validation'!$B$5:$D$8,3)","v":"Very Small"},{"$f":"_xlfn.XLOOKUP(U14,IF(E14<=55,'HPWH Validation'!$B$12:$B$15,'HPWH Validation'!$B$16:$B$19),IF(E14<=55,'HPWH Validation'!$E$12:$E$15,'HPWH Validation'!$E$16:$E$19))","v":-8.0000000000000004E-4},{"$f":"_xlfn.XLOOKUP(U14,IF(E14<=55,'HPWH Validation'!$B$12:$B$15,'HPWH Validation'!$B$16:$B$19),IF(E14<=55,'HPWH Validation'!$F$12:$F$15,'HPWH Validation'!$F$16:$F$19))","v":0.88080000000000003},0.88080000000000003,{"$f":"_xlfn.XLOOKUP(A14,HPWHBldgList,'HPWH Validation'!$L$4:$L$17)","v":{"$error":"#N/A"}},{"$error":"#N/A"},0,3.08,{"$f":"_xlfn.XLOOKUP(I14,'HPWH Validation'!$P$4:$P$5,'HPWH Validation'!$Q$4:$Q$5)","v":{"$error":"#N/A"}},0,1.33,0,0,{"$error":"#N/A"},0.53,0,0,{"$f":"'HPWH Validation'!$A$1","v":500},0,0,0,null,""]
[{"$f":"HPWH!A16","v":0},{"$f":"HPWH!B16","v":0},{"$f":"HPWH!C16","v":0},{"$f":"HPWH!D16","v":0},{"$f":"HPWH!E16","v":0},{"$f":"HPWH!F16","v":0},{"$f":"HPWH!G16","v":0},{"$f":"HPWH!H16","v":0},{"$f":"HPWH!I16","v":0},{"$f":"HPWH!J16","v":0},{"$f":"HPWH!K16","v":0},{"$f":"_xlfn.XLOOKUP(B15,'HPWH Validation'!$A$23:$A$25,'HPWH Validation'!$B$23:$B$25)","v":{"$error":"#N/A"}},"No",{"$error":"#N/A"},1,{"$f":"IF(SUM(A15:H15,K15)=0,\"\",_xlfn.XLOOKUP(O15,'HPWH Validation'!$A$29:$A$31,'HPWH Validation'!$B$29:$B$31))","v":""},8.33,1,125,{"$f":"'HPWH Validation'!$O$10","v":69.400000000000006},{"$f":"VLOOKUP(G15,'HPWH Validation'!$B$5:$D$8,3)","v":"Very Small"},{"$f":"_xlfn.XLOOKUP(U15,IF(E15<=55,'HPWH Validation'!$B$12:$B$15,'HPWH Validation'!$B$16:$B$19),IF(E15<=55,'HPWH Validation'!$E$12:$E$15,'HPWH Validation'!$E$16:$E$19))","v":-8.0000000000000004E-4},{"$f":"_xlfn.XLOOKUP(U15,IF(E15<=55,'HPWH Validation'!$B$12:$B$15,'HPWH Validation'!$B$16:$B$19),IF(E15<=55,'HPWH Validation'!$F$12:$F$15,'HPWH Validation'!$F$16:$F$19))","v":0.88080000000000003},0.88080000000000003,{"$f":"_xlfn.XLOOKUP(A15,HPWHBldgList,'HPWH Validation'!$L$4:$L$17)","v":{"$error":"#N/A"}},{"$error":"#N/A"},0,3.08,{"$f":"_xlfn.XLOOKUP(I15,'HPWH Validation'!$P$4:$P$5,'HPWH Validation'!$Q$4:$Q$5)","v":{"$error":"#N/A"}},0,1.33,0,0,{"$error":"#N/A"},0.53,0,0,{"$f":"'HPWH Validation'!$A$1","v":500},0,0,0,null,""]
[{"$f":"HPWH!A17","v":0},{"$f":"HPWH!B17","v":0},{"$f":"HPWH!C17","v":0},{"$f":"HPWH!D17","v":0},{"$f":"HPWH!E17","v":0},{"$f":"HPWH!F17","v":0},{"$f":"HPWH!G17","v":0},{"$f":"HPWH!H17","v":0},{"$f":"HPWH!I17","v":0},{"$f":"HPWH!J17","v":0},{"$f":"HPWH!K17","v":0},{"$f":"_xlfn.XLOOKUP(B16,'HPWH Validation'!$A$23:$A$25,'HPWH Validation'!$B$23:$B$25)","v":{"$error":"#N/A"}},"No",{"$error":"#N/A"},1,{"$f":"IF(SUM(A16:H16,K16)=0,\"\",_xlfn.XLOOKUP(O16,'HPWH Validation'!$A$29:$A$31,'HPWH Validation'!$B$29:$B$31))","v":""},8.33,1,125,{"$f":"'HPWH Validation'!$O$10","v":69.400000000000006},{"$f":"VLOOKUP(G16,'HPWH Validation'!$B$5:$D$8,3)","v":"Very Small"},{"$f":"_xlfn.XLOOKUP(U16,IF(E16<=55,'HPWH Validation'!$B$12:$B$15,'HPWH Validation'!$B$16:$B$19),IF(E16<=55,'HPWH Validation'!$E$12:$E$15,'HPWH Validation'!$E$16:$E$19))","v":-8.0000000000000004E-4},{"$f":"_xlfn.XLOOKUP(U16,IF(E16<=55,'HPWH Validation'!$B$12:$B$15,'HPWH Validation'!$B$16:$B$19),IF(E16<=55,'HPWH Validation'!$F$12:$F$15,'HPWH Validation'!$F$16:$F$19))","v":0.88080000000000003},0.88080000000000003,{"$f":"_xlfn.XLOOKUP(A16,HPWHBldgList,'HPWH Validation'!$L$4:$L$17)","v":{"$error":"#N/A"}},{"$error":"#N/A"},0,3.08,{"$f":"_xlfn.XLOOKUP(I16,'HPWH Validation'!$P$4:$P$5,'HPWH Validation'!$Q$4:$Q$5)","v":{"$error":"#N/A"}},0,1.33,0,0,{"$error":"#N/A"},0.53,0,0,{"$f":"'HPWH Validation'!$A$1","v":500},0,0,0,null,""]
[{"$f":"HPWH!A18","v":0},{"$f":"HPWH!B18","v":0},{"$f":"HPWH!C18","v":0},{"$f":"HPWH!D18","v":0},{"$f":"HPWH!E18","v":0},{"$f":"HPWH!F18","v":0},{"$f":"HPWH!G18","v":0},{"$f":"HPWH!H18","v":0},{"$f":"HPWH!I18","v":0},{"$f":"HPWH!J18","v":0},{"$f":"HPWH!K18","v":0},{"$f":"_xlfn.XLOOKUP(B17,'HPWH Validation'!$A$23:$A$25,'HPWH Validation'!$B$23:$B$25)","v":{"$error":"#N/A"}},"No",{"$error":"#N/A"},1,{"$f":"IF(SUM(A17:H17,K17)=0,\"\",_xlfn.XLOOKUP(O17,'HPWH Validation'!$A$29:$A$31,'HPWH Validation'!$B$29:$B$31))","v":""},8.33,1,125,{"$f":"'HPWH Validation'!$O$10","v":69.400000000000006},{"$f":"VLOOKUP(G17,'HPWH Validation'!$B$5:$D$8,3)","v":"Very Small"},{"$f":"_xlfn.XLOOKUP(U17,IF(E17<=55,'HPWH Validation'!$B$12:$B$15,'HPWH Validation'!$B$16:$B$19),IF(E17<=55,'HPWH Validation'!$E$12:$E$15,'HPWH Validation'!$E$16:$E$19))","v":-8.0000000000000004E-4},{"$f":"_xlfn.XLOOKUP(U17,IF(E17<=55,'HPWH Validation'!$B$12:$B$15,'HPWH Validation'!$B$16:$B$19),IF(E17<=55,'HPWH Validation'!$F$12:$F$15,'HPWH Validation'!$F$16:$F$19))","v":0.88080000000000003},0.88080000000000003,{"$f":"_xlfn.XLOOKUP(A17,HPWHBldgList,'HPWH Validation'!$L$4:$L$17)","v":{"$error":"#N/A"}},{"$error":"#N/A"},0,3.08,{"$f":"_xlfn.XLOOKUP(I17,'HPWH Validation'!$P$4:$P$5,'HPWH Validation'!$Q$4:$Q$5)","v":{"$error":"#N/A"}},0,1.33,0,0,{"$error":"#N/A"},0.53,0,0,{"$f":"'HPWH Validation'!$A$1","v":500},0,0,0,null,""]
[{"$f":"HPWH!A19","v":0},{"$f":"HPWH!B19","v":0},{"$f":"HPWH!C19","v":0},{"$f":"HPWH!D19","v":0},{"$f":"HPWH!E19","v":0},{"$f":"HPWH!F19","v":0},{"$f":"HPWH!G19","v":0},{"$f":"HPWH!H19","v":0},{"$f":"HPWH!I19","v":0},{"$f":"HPWH!J19","v":0},{"$f":"HPWH!K19","v":0},{"$f":"_xlfn.XLOOKUP(B18,'HPWH Validation'!$A$23:$A$25,'HPWH Validation'!$B$23:$B$25)","v":{"$error":"#N/A"}},"No",{"$error":"#N/A"},1,{"$f":"IF(SUM(A18:H18,K18)=0,\"\",_xlfn.XLOOKUP(O18,'HPWH Validation'!$A$29:$A$31,'HPWH Validation'!$B$29:$B$31))","v":""},8.33,1,125,{"$f":"'HPWH Validation'!$O$10","v":69.400000000000006},{"$f":"VLOOKUP(G18,'HPWH Validation'!$B$5:$D$8,3)","v":"Very Small"},{"$f":"_xlfn.XLOOKUP(U18,IF(E18<=55,'HPWH Validation'!$B$12:$B$15,'HPWH Validation'!$B$16:$B$19),IF(E18<=55,'HPWH Validation'!$E$12:$E$15,'HPWH Validation'!$E$16:$E$19))","v":-8.0000000000000004E-4},{"$f":"_xlfn.XLOOKUP(U18,IF(E18<=55,'HPWH Validation'!$B$12:$B$15,'HPWH Validation'!$B$16:$B$19),IF(E18<=55,'HPWH Validation'!$F$12:$F$15,'HPWH Validation'!$F$16:$F$19))","v":0.88080000000000003},0.88080000000000003,{"$f":"_xlfn.XLOOKUP(A18,HPWHBldgList,'HPWH Validation'!$L$4:$L$17)","v":{"$error":"#N/A"}},{"$error":"#N/A"},0,3.08,{"$f":"_xlfn.XLOOKUP(I18,'HPWH Validation'!$P$4:$P$5,'HPWH Validation'!$Q$4:$Q$5)","v":{"$error":"#N/A"}},0,1.33,0,0,{"$error":"#N/A"},0.53,0,0,{"$f":"'HPWH Validation'!$A$1","v":500},0,0,0,null,""]

{"sheet":"HPWH Validation","index":17,"n_rows":31,"n_cols":18,"rows_kept":31,"cut":false,"hidden":true,"merged":[[2,3,2,4],[11,0,14,0],[15,0,18,0]]}
[500,"Incentive ($/unit)"]
[null,null,null,"From IL TRM v13",null,null,null,null,null,null,"From IL TRM v13"]
[null,null,null,"Storage Water Heater Draw Pattern",null,null,null,null,null,null,"Building Type","Consumption/Cap",null,"HPWH Type","HPWH Location","HPWH Space Heating Type","COP","HPWH Space Cooling Type"]
[null,"≥ FHR","< FHR","Draw Pattern","First Hour Rating (gallons)",null,null,null,null,null,"Convenience",528,null,"Integrated HPWH, 240V","Unconditioned Space","Electric Resistance Heat",1,"A/C"]
[null,0,18,"Very Small","≥ 0 and < 18",null,null,null,null,null,"Education",568,null,"Integrated HPWH, 120V","Conditioned Space","Heat pump",2.04,"No A/C"]
[null,18,51,"Low","≥ 18 and < 51",null,null,null,null,null,"Grocery",528,null,"Split-system HPWH",null,"Other/None"]
[null,51,75,"Medium","≥ 51 and < 75",null,null,null,null,null,"Health",788]
[null,75,9999,"High","≥ 75",null,null,null,null,null,"Large Office",511]
[null,null,null,null,null,null,null,null,null,null,"Large Retail",528,null,"ODC recommended value 7/21/25 - from Incoming water temperature for Census Division 5 is 69.4F according to LBNL report \"Calculating Average Hot Water Mixes of Residential Plumbing Fixtures\", June 2020."]
[null,null,null,null,null,null,null,null,null,null,"Lodging",715,null,"South Carolina",69.400000000000006]
["Rated storage volume","Draw pattern","FHR 451,452","UEF453","m","b",null,null,null,null,"Other Commercial",341]
["≥ 20 gal and\n≤ 55 gal","Very Small","0 ≤ FHR < 18","0.8808 − (0.0008 × Vr)",-8.0000000000000004E-4,0.88080000000000003,null,null,null,null,"Restaurant",622]
[null,"Low","18 ≤ FHR < 51","0.9254 − (0.0003 × Vr)",-2.9999999999999997E-4,0.9254,null,null,null,null,"Small Office",511]
[null,"Medium","51 ≤ FHR < 75","0.9307 − (0.0002 × Vr)",-2.0000000000000001E-4,0.93069999999999997,null,null,null,null,"Small Retail",528]
[null,"High","75 ≤ FHR","0.9349 − (0.0001 × Vr)",-1E-4,0.93489999999999995,null,null,null,null,"Warehouse",341]
["> 55 gal and\n≤ 120 gal","Very small","0 ≤ FHR < 18","1.9236 − (0.0011 × Vr)",-1.1000000000000001E-3,1.9236,null,null,null,null,"Nursing",672]
[null,"Low","18 ≤ FHR < 51","2.0440 − (0.0011 × Vr)",-1.1000000000000001E-3,2.044,null,null,null,null,"Multi-Family",894]
[null,"Medium","51 ≤ FHR < 75","2.1171 − (0.0011 × Vr)",-1.1000000000000001E-3,2.1171000000000002]
[null,"High","75 ≤ FHR","2.2418 − (0.0011 × Vr)",-1.1000000000000001E-3,2.2418]
[]
[]
["HPWH Type","Qualifying UEF"]
["Integrated HPWH, 240V",3.3]
["Integrated HPWH, 120V",2.2000000000000002]
["Split-system HPWH",2.2000000000000002]
[]
[]
["Error Number","Error Message","Qualifies"]
[0,"Yes","Yes"]
[1,"Error message 1 - See below","No. Please fill in all blue cells."]
[2,"Error message 2 - See below","No. Efficiency doesn't meet minimum requirements."]

{"sheet":"Guestroom Energy Management","index":18,"n_rows":19,"n_cols":17,"rows_kept":19,"cut":false,"hidden":false,"merged":[[0,0,0,9],[2,0,2,9],[3,0,3,9],[4,0,4,9],[16,0,16,8]]}
["Fill in Blue Cells Only!"]
[]
["GUESTROOM ENERGY MANAGEMENT TECHNICAL REQUIREMENTS AND INCENTIVES"]
["To qualify for an incentive:\n▪ Guestroom Energy Management system must control the HVAC unit in the guest/dorm room with occupancy controls and can optionally control the lighting.\n▪ The occupancy-based control system must include, but not be limited to, infrared sensors, ultrasonic sensors, door magnetic strip sensors, and/or card-key sensors\n▪ The controls must set back/set up the temperature 5 degrees or 10 degrees when unoccupied\n▪ Only Packaged Terminal Air Conditioner (PTAC) or Packaged Terminal Heat Pump (PTHP) are eligible HVAC units to control. \n▪ If other HVAC system types are desired to be controlled, please contact your Program representative about the Custom Program.\n\nWorkbook Instructions:\n▪ All blue cells below are required to be filled in to calculate if qualifies for incentive."]
["Guestroom Energy Management Controls"]
["Business Type","Manufacturer","Model","Controlled Equipment","Controlled HVAC Equipment","Temperature Setback Controls","Quantity","Incentive Rate","Qualifies","Total Incentive",null,null,null,"Incentive Per unit","kWh","Winter kW","Total Incentive"]
[null,null,null,null,null,null,null,"$100/controlled unit",{"$f":"'GREM Calculations'!K9","v":""},{"$f":"Q7","v":0},null,null,null,{"$f":"Q7/G7","v":{"$error":"#DIV/0!"}},{"$f":"'GREM Calculations'!P9","v":0},{"$f":"'GREM Calculations'!Q9","v":0},{"$f":"'GREM Calculations'!S9","v":0}]
[null,null,null,null,null,null,null,"$100/controlled unit",{"$f":"'GREM Calculations'!K10","v":""},{"$f":"Q8","v":0},null,null,null,{"$f":"Q8/G8","v":{"$error":"#DIV/0!"}},{"$f":"'GREM Calculations'!P10","v":0},{"$f":"'GREM Calculations'!Q10","v":0},{"$f":"'GREM Calculations'!S10","v":0}]
[null,null,null,null,null,null,null,"$100/controlled unit",{"$f":"'GREM Calculations'!K11","v":""},0,null,null,null,{"$error":"#DIV/0!"},{"$f":"'GREM Calculations'!P11","v":0},{"$f":"'GREM Calculations'!Q11","v":0},{"$f":"'GREM Calculations'!S11","v":0}]
[null,null,null,null,null,null,null,"$100/controlled unit",{"$f":"'GREM Calculations'!K12","v":""},0,null,null,null,{"$error":"#DIV/0!"},{"$f":"'GREM Calculations'!P12","v":0},{"$f":"'GREM Calculations'!Q12","v":0},{"$f":"'GREM Calculations'!S12","v":0}]
[null,null,null,null,null,null,null,"$100/controlled unit",{"$f":"'GREM Calculations'!K13","v":""},0,null,null,null,{"$error":"#DIV/0!"},{"$f":"'GREM Calculations'!P13","v":0},{"$f":"'GREM Calculations'!Q13","v":0},{"$f":"'GREM Calculations'!S13","v":0}]
[null,null,null,null,null,null,null,"$100/controlled unit",{"$f":"'GREM Calculations'!K14","v":""},0,null,null,null,{"$error":"#DIV/0!"},{"$f":"'GREM Calculations'!P14","v":0},{"$f":"'GREM Calculations'!Q14","v":0},{"$f":"'GREM Calculations'!S14","v":0}]
[null,null,null,null,null,null,null,"$100/controlled unit",{"$f":"'GREM Calculations'!K15","v":""},0,null,null,null,{"$error":"#DIV/0!"},{"$f":"'GREM Calculations'!P15","v":0},{"$f":"'GREM Calculations'!Q15","v":0},{"$f":"'GREM Calculations'!S15","v":0}]
[null,null,null,null,null,null,null,"$100/controlled unit",{"$f":"'GREM Calculations'!K16","v":""},0,null,null,null,{"$error":"#DIV/0!"},{"$f":"'GREM Calculations'!P16","v":0},{"$f":"'GREM Calculations'!Q16","v":0},{"$f":"'GREM Calculations'!S16","v":0}]
[null,null,null,null,null,null,null,"$100/controlled unit",{"$f":"'GREM Calculations'!K17","v":""},0,null,null,null,{"$error":"#DIV/0!"},{"$f":"'GREM Calculations'!P17","v":0},{"$f":"'GREM Calculations'!Q17","v":0},{"$f":"'GREM Calculations'!S17","v":0}]
[null,null,null,null,null,null,null,"$100/controlled unit",{"$f":"'GREM Calculations'!K18","v":""},0,null,null,null,{"$error":"#DIV/0!"},{"$f":"'GREM Calculations'!P18","v":0},{"$f":"'GREM Calculations'!Q18","v":0},{"$f":"'GREM Calculations'!S18","v":0}]
["Total Requested Incentive",null,null,null,null,null,null,null,null,{"$f":"SUM(J7:J16)","v":0}]
[]
[null,null,null,null,null,null,null,null,null,{"$f":"\"Version \"  &  'Version Tracking'!C4","v":"Version 15.2"}]

{"sheet":"GREM Calculations","index":19,"n_rows":18,"n_cols":22,"rows_kept":18,"cut":false,"hidden":true,"merged":[]}
[]
[]
[]
[]
[]
[]
[]
[null,"Business Type","Manufacturer","Model","Controlled Equipment","Controlled HVAC Equipment","Degree Setback Design","Quantity","CFw","All blue cells filled in?","Qualifies","Temp Control","concat","kWh/unit","Winter kW/unit","Total kWh","Total Winter kW","Incentive/unit","Incentive","EUL",null,"$/kWh"]
[1,{"$f":"'Guestroom Energy Management'!A7","v":0},{"$f":"'Guestroom Energy Management'!B7","v":0},{"$f":"'Guestroom Energy Management'!C7","v":0},{"$f":"'Guestroom Energy Management'!D7","v":0},{"$f":"'Guestroom Energy Management'!E7","v":0},{"$f":"'Guestroom Energy Management'!F7","v":0},{"$f":"'Guestroom Energy Management'!G7","v":0},{"$f":"'GREM Validation'!$B$10","v":8.7999999999999998E-5},{"$f":"IF(AND(B9<>0,C9<>0,D9<>0,E9<>0,F9<>0,G9<>0,H9<>0),\"Yes\",IF(AND(B9=0,E9=0,F9=0,G9=0,H9=0),\"\",\"No. Please fill in all blue cells\"))","v":""},{"$f":"IF(J9=\"\",\"\",J9)","v":""},{"$f":"IFERROR(_xlfn.XLOOKUP(G9,DegSetback,'GREM Validation'!$C$2:$C$3),0)","v":0},{"$f":"B9&L9&E9&F9","v":"0000"},{"$f":"IF(K9=\"Yes\",_xlfn.XLOOKUP(M9,'GREM Validation'!$AB$3:$AB$26,'GREM Validation'!$AC$3:$AC$26),0)","v":0},{"$f":"IF(K9=\"Yes\",_xlfn.XLOOKUP(M9,'GREM Validation'!$AB$3:$AB$26,'GREM Validation'!$AD$3:$AD$26),0)","v":0},{"$f":"N9*$H9","v":0},{"$f":"O9*$H9","v":0},{"$f":"IF(K9=\"Yes\",'GREM Validation'!$K$1,0)","v":0},{"$f":"R9*H9","v":0},15,null,{"$f":"S9/P9","v":{"$error":"#DIV/0!"}}]
[2,{"$f":"'Guestroom Energy Management'!A8","v":0},{"$f":"'Guestroom Energy Management'!B8","v":0},{"$f":"'Guestroom Energy Management'!C8","v":0},{"$f":"'Guestroom Energy Management'!D8","v":0},{"$f":"'Guestroom Energy Management'!E8","v":0},{"$f":"'Guestroom Energy Management'!F8","v":0},{"$f":"'Guestroom Energy Management'!G8","v":0},{"$f":"'GREM Validation'!$B$10","v":8.7999999999999998E-5},{"$f":"IF(AND(B10<>0,C10<>0,D10<>0,E10<>0,F10<>0,G10<>0,H10<>0),\"Yes\",IF(AND(B10=0,E10=0,F10=0,G10=0,H10=0),\"\",\"No. Please fill in all blue cells\"))","v":""},{"$f":"IF(J10=\"\",\"\",J10)","v":""},{"$f":"IFERROR(_xlfn.XLOOKUP(G10,DegSetback,'GREM Validation'!$C$2:$C$3),0)","v":0},{"$f":"B10&L10&E10&F10","v":"0000"},{"$f":"IF(K10=\"Yes\",_xlfn.XLOOKUP(M10,'GREM Validation'!$AB$3:$AB$26,'GREM Validation'!$AC$3:$AC$26),0)","v":0},{"$f":"IF(K10=\"Yes\",_xlfn.XLOOKUP(M10,'GREM Validation'!$AB$3:$AB$26,'GREM Validation'!$AD$3:$AD$26),0)","v":0},0,0,{"$f":"IF(K10=\"Yes\",'GREM Validation'!$K$1,0)","v":0},{"$f":"R10*H10","v":0},15,null,{"$f":"S10/P10","v":{"$error":"#DIV/0!"}}]
[3,{"$f":"'Guestroom Energy Management'!A9","v":0},{"$f":"'Guestroom Energy Management'!B9","v":0},{"$f":"'Guestroom Energy Management'!C9","v":0},{"$f":"'Guestroom Energy Management'!D9","v":0},{"$f":"'Guestroom Energy Management'!E9","v":0},{"$f":"'Guestroom Energy Management'!F9","v":0},{"$f":"'Guestroom Energy Management'!G9","v":0},{"$f":"'GREM Validation'!$B$10","v":8.7999999999999998E-5},{"$f":"IF(AND(B11<>0,C11<>0,D11<>0,E11<>0,F11<>0,G11<>0,H11<>0),\"Yes\",IF(AND(B11=0,E11=0,F11=0,G11=0,H11=0),\"\",\"No. Please fill in all blue cells\"))","v":""},"",{"$f":"IFERROR(_xlfn.XLOOKUP(G11,DegSetback,'GREM Validation'!$C$2:$C$3),0)","v":0},"0000",{"$f":"IF(K11=\"Yes\",_xlfn.XLOOKUP(M11,'GREM Validation'!$AB$3:$AB$26,'GREM Validation'!$AC$3:$AC$26),0)","v":0},{"$f":"IF(K11=\"Yes\",_xlfn.XLOOKUP(M11,'GREM Validation'!$AB$3:$AB$26,'GREM Validation'!$AD$3:$AD$26),0)","v":0},0,0,{"$f":"IF(K11=\"Yes\",'GREM Validation'!$K$1,0)","v":0},0,15,null,{"$error":"#DIV/0!"}]
[4,{"$f":"'Guestroom Energy Management'!A10","v":0},{"$f":"'Guestroom Energy Management'!B10","v":0},{"$f":"'Guestroom Energy Management'!C10","v":0},{"$f":"'Guestroom Energy Management'!D10","v":0},{"$f":"'Guestroom Energy Management'!E10","v":0},{"$f":"'Guestroom Energy Management'!F10","v":0},{"$f":"'Guestroom Energy Management'!G10","v":0},{"$f":"'GREM Validation'!$B$10","v":8.7999999999999998E-5},"","",{"$f":"IFERROR(_xlfn.XLOOKUP(G12,DegSetback,'GREM Validation'!$C$2:$C$3),0)","v":0},"0000",{"$f":"IF(K12=\"Yes\",_xlfn.XLOOKUP(M12,'GREM Validation'!$AB$3:$AB$26,'GREM Validation'!$AC$3:$AC$26),0)","v":0},{"$f":"IF(K12=\"Yes\",_xlfn.XLOOKUP(M12,'GREM Validation'!$AB$3:$AB$26,'GREM Validation'!$AD$3:$AD$26),0)","v":0},0,0,{"$f":"IF(K12=\"Yes\",'GREM Validation'!$K$1,0)","v":0},0,15,null,{"$error":"#DIV/0!"}]
[5,{"$f":"'Guestroom Energy Management'!A11","v":0},{"$f":"'Guestroom Energy Management'!B11","v":0},{"$f":"'Guestroom Energy Management'!C11","v":0},{"$f":"'Guestroom Energy Management'!D11","v":0},{"$f":"'Guestroom Energy Management'!E11","v":0},{"$f":"'Guestroom Energy Management'!F11","v":0},{"$f":"'Guestroom Energy Management'!G11","v":0},{"$f":"'GREM Validation'!$B$10","v":8.7999999999999998E-5},"","",{"$f":"IFERROR(_xlfn.XLOOKUP(G13,DegSetback,'GREM Validation'!$C$2:$C$3),0)","v":0},"0000",{"$f":"IF(K13=\"Yes\",_xlfn.XLOOKUP(M13,'GREM Validation'!$AB$3:$AB$26,'GREM Validation'!$AC$3:$AC$26),0)","v":0},{"$f":"IF(K13=\"Yes\",_xlfn.XLOOKUP(M13,'GREM Validation'!$AB$3:$AB$26,'GREM Validation'!$AD$3:$AD$26),0)","v":0},0,0,{"$f":"IF(K13=\"Yes\",'GREM Validation'!$K$1,0)","v":0},0,15,null,{"$error":"#DIV/0!"}]
[6,{"$f":"'Guestroom Energy Management'!A12","v":0},{"$f":"'Guestroom Energy Management'!B12","v":0},{"$f":"'Guestroom Energy Management'!C12","v":0},{"$f":"'Guestroom Energy Management'!D12","v":0},{"$f":"'Guestroom Energy Management'!E12","v":0},{"$f":"'Guestroom Energy Management'!F12","v":0},{"$f":"'Guestroom Energy Management'!G12","v":0},{"$f":"'GREM Validation'!$B$10","v":8.7999999999999998E-5},"","",{"$f":"IFERROR(_xlfn.XLOOKUP(G14,DegSetback,'GREM Validation'!$C$2:$C$3),0)","v":0},"0000",{"$f":"IF(K14=\"Yes\",_xlfn.XLOOKUP(M14,'GREM Validation'!$AB$3:$AB$26,'GREM Validation'!$AC$3:$AC$26),0)","v":0},{"$f":"IF(K14=\"Yes\",_xlfn.XLOOKUP(M14,'GREM Validation'!$AB$3:$AB$26,'GREM Validation'!$AD$3:$AD$26),0)","v":0},0,0,{"$f":"IF(K14=\"Yes\",'GREM Validation'!$K$1,0)","v":0},0,15,null,{"$error":"#DIV/0!"}]
[7,{"$f":"'Guestroom Energy Management'!A13","v":0},{"$f":"'Guestroom Energy Management'!B13","v":0},{"$f":"'Guestroom Energy Management'!C13","v":0},{"$f":"'Guestroom Energy Management'!D13","v":0},{"$f":"'Guestroom Energy Management'!E13","v":0},{"$f":"'Guestroom Energy Management'!F13","v":0},{"$f":"'Guestroom Energy Management'!G13","v":0},{"$f":"'GREM Validation'!$B$10","v":8.7999999999999998E-5},"","",{"$f":"IFERROR(_xlfn.XLOOKUP(G15,DegSetback,'GREM Validation'!$C$2:$C$3),0)","v":0},"0000",{"$f":"IF(K15=\"Yes\",_xlfn.XLOOKUP(M15,'GREM Validation'!$AB$3:$AB$26,'GREM Validation'!$AC$3:$AC$26),0)","v":0},{"$f":"IF(K15=\"Yes\",_xlfn.XLOOKUP(M15,'GREM Validation'!$AB$3:$AB$26,'GREM Validation'!$AD$3:$AD$26),0)","v":0},0,0,{"$f":"IF(K15=\"Yes\",'GREM Validation'!$K$1,0)","v":0},0,15,null,{"$error":"#DIV/0!"}]
[8,{"$f":"'Guestroom Energy Management'!A14","v":0},{"$f":"'Guestroom Energy Management'!B14","v":0},{"$f":"'Guestroom Energy Management'!C14","v":0},{"$f":"'Guestroom Energy Management'!D14","v":0},{"$f":"'Guestroom Energy Management'!E14","v":0},{"$f":"'Guestroom Energy Management'!F14","v":0},{"$f":"'Guestroom Energy Management'!G14","v":0},{"$f":"'GREM Validation'!$B$10","v":8.7999999999999998E-5},"","",{"$f":"IFERROR(_xlfn.XLOOKUP(G16,DegSetback,'GREM Validation'!$C$2:$C$3),0)","v":0},"0000",{"$f":"IF(K16=\"Yes\",_xlfn.XLOOKUP(M16,'GREM Validation'!$AB$3:$AB$26,'GREM Validation'!$AC$3:$AC$26),0)","v":0},{"$f":"IF(K16=\"Yes\",_xlfn.XLOOKUP(M16,'GREM Validation'!$AB$3:$AB$26,'GREM Validation'!$AD$3:$AD$26),0)","v":0},0,0,{"$f":"IF(K16=\"Yes\",'GREM Validation'!$K$1,0)","v":0},0,15,null,{"$error":"#DIV/0!"}]
[9,{"$f":"'Guestroom Energy Management'!A15","v":0},{"$f":"'Guestroom Energy Management'!B15","v":0},{"$f":"'Guestroom Energy Management'!C15","v":0},{"$f":"'Guestroom Energy Management'!D15","v":0},{"$f":"'Guestroom Energy Management'!E15","v":0},{"$f":"'Guestroom Energy Management'!F15","v":0},{"$f":"'Guestroom Energy Management'!G15","v":0},{"$f":"'GREM Validation'!$B$10","v":8.7999999999999998E-5},"","",{"$f":"IFERROR(_xlfn.XLOOKUP(G17,DegSetback,'GREM Validation'!$C$2:$C$3),0)","v":0},"0000",{"$f":"IF(K17=\"Yes\",_xlfn.XLOOKUP(M17,'GREM Validation'!$AB$3:$AB$26,'GREM Validation'!$AC$3:$AC$26),0)","v":0},{"$f":"IF(K17=\"Yes\",_xlfn.XLOOKUP(M17,'GREM Validation'!$AB$3:$AB$26,'GREM Validation'!$AD$3:$AD$26),0)","v":0},0,0,{"$f":"IF(K17=\"Yes\",'GREM Validation'!$K$1,0)","v":0},0,15,null,{"$error":"#DIV/0!"}]
[10,{"$f":"'Guestroom Energy Management'!A16","v":0},{"$f":"'Guestroom Energy Management'!B16","v":0},{"$f":"'Guestroom Energy Management'!C16","v":0},{"$f":"'Guestroom Energy Management'!D16","v":0},{"$f":"'Guestroom Energy Management'!E16","v":0},{"$f":"'Guestroom Energy Management'!F16","v":0},{"$f":"'Guestroom Energy Management'!G16","v":0},{"$f":"'GREM Validation'!$B$10","v":8.7999999999999998E-5},"","",{"$f":"IFERROR(_xlfn.XLOOKUP(G18,DegSetback,'GREM Validation'!$C$2:$C$3),0)","v":0},"0000",{"$f":"IF(K18=\"Yes\",_xlfn.XLOOKUP(M18,'GREM Validation'!$AB$3:$AB$26,'GREM Validation'!$AC$3:$AC$26),0)","v":0},{"$f":"IF(K18=\"Yes\",_xlfn.XLOOKUP(M18,'GREM Validation'!$AB$3:$AB$26,'GREM Validation'!$AD$3:$AD$26),0)","v":0},0,0,{"$f":"IF(K18=\"Yes\",'GREM Validation'!$K$1,0)","v":0},0,15,null,{"$error":"#DIV/0!"}]

{"sheet":"GREM Validation","index":20,"n_rows":48,"n_cols":30,"rows_kept":48,"cut":false,"hidden":true,"merged":[[4,7,4,10],[4,11,4,14],[5,7,5,14],[6,7,6,8],[6,9,6,10],[6,11,6,12],[6,13,6,14],[10,7,10,14],[11,7,11,8],[11,9,11,10],[11,11,11,12],[11,13,11,14],[17,7,17,10],[17,11,17,14],[18,7,18,14],[19,7,19,8],[19,9,19,10],[19,11,19,12],[19,13,19,14],[31,7,31,14],[23,7,23,14],[24,7,24,8],[24,9,24,10],[24,11,24,12],[24,13,24,14],[30,7,30,10],[30,11,30,14],[37,7,37,8],[37,9,37,10],[37,11,37,12],[37,13,37,14],[32,7,32,8],[32,9,32,10],[32,11,32,12],[32,13,32,14],[36,7,36,14]]}
["Business Type","Degree Setback","Degree Setback","ControlType","HVAC Type",null,null,null,null,"Incentive",100,"$/unit"]
["Hotel","5 degrees",5,"HVAC Only","PTAC",null,null,null,null,null,null,null,null,null,null,null,"Lodging Type","Degree Setback Design","Controlled Equipment Scope","HVAC Type","Climate Zone","TX CZ5 kWh/unit","TX CZ2 kWh/unit","Normalized Dallas to SC CDD","Normalized El Paso to SC CDD","Average kWh/unit (SC)",null,"CONCANTENATED VALUES","kWh/unit","Winter kW/unit1"]
["Motel","10 degrees",10,"HVAC and Lighting","PTHP",null,null,"TX TRM - CZ2 - Dallas and CZ5 El Paso used - Values are per unit",null,null,null,null,null,null,null,null,"Dorm",10,"HVAC and Lighting","PTAC",3,{"$f":"O41","v":450},{"$f":"O40","v":511},{"$f":"W3*$J$44","v":404.73727915194348},{"$f":"V3*$J$45","v":412.37735077677843},{"$f":"AVERAGE(X3:Y3)","v":408.55731496436096},null,"Dorm10HVAC and LightingPTAC",{"$f":"Z3","v":408.55731496436096},{"$f":"AC3*$B$10","v":3.595304371686376E-2}]
["Dorm",null,null,null,null,null,null,"Table 259. Lodging Occupancy Sensors—Motel per Room Energy and Peak Demand Savings",null,null,null,null,null,null,null,null,"Dorm",10,"HVAC and Lighting","PTHP",3,{"$f":"K41","v":448},{"$f":"K40","v":505},{"$f":"W4*$J$44","v":399.98498233215548},{"$f":"V4*$J$45","v":410.54456255110381},{"$f":"AVERAGE(X4:Y4)","v":405.26477244162965},null,"Dorm10HVAC and LightingPTHP",405.26477244162965,{"$f":"AC4*$B$10","v":3.5663299974863408E-2}]
[null,null,null,null,null,null,null,"Heat Pump",null,null,null,"Electric Resistance",null,null,null,null,"Dorm",10,"HVAC Only","PTAC",3,{"$f":"M41","v":153},{"$f":"M40","v":304},240.78303886925795,140.20829926410465,190.4956690666813,null,"Dorm10HVAC OnlyPTAC",190.4956690666813,1.6763618877867953E-2]
[null,null,null,null,null,null,null,"5-degree setup/setback offset",null,null,null,null,null,null,null,null,"Dorm",10,"HVAC Only","PTHP",3,{"$f":"I41","v":151},{"$f":"I40","v":293},232.07049469964664,138.37551103843009,185.22300286903837,null,"Dorm10HVAC OnlyPTHP",185.22300286903837,1.6299624252475376E-2]
[null,null,null,null,null,null,null,"HVAC only",null,"HVAC and lighting",null,"HVAC only",null,"HVAC and lighting",null,null,"Dorm",5,"HVAC and Lighting","PTAC",3,{"$f":"O36","v":326},{"$f":"O35","v":428},338.99717314487634,298.74448078495504,318.87082696491569,null,"Dorm5HVAC and LightingPTAC",318.87082696491569,2.806063277291258E-2]
[null,null,null,null,null,null,null,"kW","kWh","kW","kWh","kW","kWh","kW","kWh",null,"Dorm",5,"HVAC and Lighting","PTHP",3,{"$f":"K36","v":327},{"$f":"K35","v":425},336.62102473498231,299.66087489779233,318.14094981638732,null,"Dorm5HVAC and LightingPTHP",318.14094981638732,2.7996403583842082E-2]
["Winter peak coincidence factor developed by ICF on 2/25/2025",null,null,null,null,null,"Dallas CZ2",7.5999999999999998E-2,315,9.0999999999999998E-2,443,7.5999999999999998E-2,365,9.0999999999999998E-2,485,null,"Dorm",5,"HVAC Only","PTAC",3,{"$f":"M36","v":110},{"$f":"M35","v":223},176.62703180212014,100.80335241210139,138.71519210711077,null,"Dorm5HVAC OnlyPTAC",138.71519210711077,1.2206936905425746E-2]
["CFw =",8.7999999999999998E-5,"kW/kWh",null,null,null,"El Paso CZ5",6.3E-2,251,7.8E-2,379,6.3E-2,283,7.8E-2,406,null,"Dorm",5,"HVAC Only","PTHP",3,{"$f":"I36","v":110},{"$f":"I35","v":214},169.49858657243817,100.80335241210139,135.15096949226978,null,"Dorm5HVAC OnlyPTHP",135.15096949226978,1.1893285315319741E-2]
[null,null,null,null,null,null,null,"10-degree setup/setback offset",null,null,null,null,null,null,null,null,"Hotel",10,"HVAC and Lighting","PTAC",3,{"$f":"O28","v":501},{"$f":"O27","v":676},535.42544169611301,459.11345053147994,497.26944611379645,null,"Hotel10HVAC and LightingPTAC",497.26944611379645,4.3759711258014089E-2]
[null,null,null,null,null,null,null,"HVAC only",null,"HVAC and lighting",null,"HVAC only",null,"HVAC and lighting",null,null,"Hotel",10,"HVAC and Lighting","PTHP",3,{"$f":"K28","v":479},{"$f":"K27","v":617},488.69452296819787,438.9527800490597,463.82365150862881,null,"Hotel10HVAC and LightingPTHP",463.82365150862881,4.0816481332759336E-2]
[null,null,null,null,null,null,null,"kW","kWh","kW","kWh","kW","kWh","kW","kWh",null,"Hotel",10,"HVAC Only","PTAC",3,{"$f":"M28","v":338},{"$f":"M27","v":517},409.48957597173143,309.74121013900242,359.61539305536689,null,"Hotel10HVAC OnlyPTAC",359.61539305536689,3.1646154588872287E-2]
[null,null,null,null,null,null,"Dallas CZ2",0.14599999999999999,559,0.161,686,0.14599999999999999,640,0.161,761,null,"Hotel",10,"HVAC Only","PTHP",3,{"$f":"I28","v":312},{"$f":"I27","v":452},358.00636042402829,285.91496320523305,321.96066181463067,null,"Hotel10HVAC OnlyPTHP",321.96066181463067,2.8332538239687496E-2]
[null,null,null,null,null,null,"El Paso CZ5",0.11799999999999999,432,0.13300000000000001,561,0.11799999999999999,482,0.13300000000000001,607,null,"Hotel",5,"HVAC and Lighting","PTAC",3,{"$f":"O23","v":380},{"$f":"O22","v":505},399.98498233215548,348.2297628781684,374.10737260516191,null,"Hotel5HVAC and LightingPTAC",374.10737260516191,3.2921448789254244E-2]
[null,null,null,null,null,null,null,null,null,null,null,null,null,null,null,null,"Hotel",5,"HVAC and Lighting","PTHP",3,{"$f":"K23","v":360},{"$f":"K22","v":452},358.00636042402829,329.90188062142272,343.95412052272547,null,"Hotel5HVAC and LightingPTHP",343.95412052272547,3.026796260599984E-2]
[null,null,null,null,null,null,null,"Table 260. Lodging Occupancy Sensors—Hotel per Room Energy and Peak Demand Savings",null,null,null,null,null,null,null,null,"Hotel",5,"HVAC Only","PTAC",3,{"$f":"M23","v":196},{"$f":"M22","v":303},239.99098939929328,179.61324611610792,209.80211775770061,null,"Hotel5HVAC OnlyPTAC",209.80211775770061,1.8462586362677655E-2]
[null,null,null,null,null,null,null,"Heat Pump",null,null,null,"Electric Resistance",null,null,null,null,"Hotel",5,"HVAC Only","PTHP",3,{"$f":"I23","v":178},{"$f":"I22","v":258},204.34876325088339,163.1181520850368,183.7334576679601,null,"Hotel5HVAC OnlyPTHP",183.7334576679601,1.6168544274780487E-2]
[null,null,null,null,null,null,null,"5-degree setup/setback offset",null,null,null,null,null,null,null,null,"Motel",10,"HVAC and Lighting","PTAC",3,{"$f":"O15","v":607},{"$f":"O14","v":761},602.74964664310949,556.25122649223215,579.50043656767082,null,"Motel10HVAC and LightingPTAC",579.50043656767082,5.0996038417955032E-2]
[null,null,null,null,null,null,null,"HVAC only",null,"HVAC and lighting",null,"HVAC only",null,"HVAC and lighting",null,null,"Motel",10,"HVAC and Lighting","PTHP",3,{"$f":"K15","v":561},{"$f":"K14","v":686},543.34593639575974,514.0970973017171,528.72151684873847,null,"Motel10HVAC and LightingPTHP",528.72151684873847,4.6527493482688982E-2]
[null,null,null,null,null,null,null,"kW","kWh","kW","kWh","kW","kWh","kW","kWh",null,"Motel",10,"HVAC Only","PTAC",3,{"$f":"M15","v":482},{"$f":"M14","v":640},506.91166077738512,441.70196238757154,474.3068115824783,null,"Motel10HVAC OnlyPTAC",474.3068115824783,4.1738999419258092E-2]
[null,null,null,null,null,null,"Dallas CZ2",7.2999999999999995E-2,258,9.2999999999999999E-2,452,7.2999999999999995E-2,303,9.2999999999999999E-2,505,null,"Motel",10,"HVAC Only","PTHP",3,{"$f":"I15","v":432},{"$f":"I14","v":559},442.75565371024732,395.88225674570725,419.31895522797731,null,"Motel10HVAC OnlyPTHP",419.31895522797731,3.6900068060062005E-2]
[null,null,null,null,null,null,"El Paso CZ5",5.6000000000000001E-2,178,7.4999999999999997E-2,360,5.6000000000000001E-2,196,7.4999999999999997E-2,380,null,"Motel",5,"HVAC and Lighting","PTAC",3,{"$f":"O10","v":406},{"$f":"O9","v":485},384.1439929328622,372.05600981193783,378.10000137240002,null,"Motel5HVAC and LightingPTAC",378.10000137240002,3.3272800120771204E-2]
[null,null,null,null,null,null,null,"10-degree setup/setback offset",null,null,null,null,null,null,null,null,"Motel",5,"HVAC and Lighting","PTHP",3,{"$f":"K10","v":379},{"$f":"K9","v":443},350.87791519434626,347.31336876533112,349.09564197983866,null,"Motel5HVAC and LightingPTHP",349.09564197983866,3.0720416494225803E-2]
[null,null,null,null,null,null,null,"HVAC only",null,"HVAC and lighting",null,"HVAC only",null,"HVAC and lighting",null,null,"Motel",5,"HVAC Only","PTAC",3,{"$f":"M10","v":283},{"$f":"M9","v":365},289.09805653710248,259.33953393295172,274.21879523502707,null,"Motel5HVAC OnlyPTAC",274.21879523502707,2.4131253980682381E-2]
[null,null,null,null,null,null,null,"kW","kWh","kW","kWh","kW","kWh","kW","kWh",null,"Motel",5,"HVAC Only","PTHP",3,{"$f":"I10","v":251},{"$f":"I9","v":315},249.49558303886926,230.01492232215861,239.75525268051393,null,"Motel5HVAC OnlyPTHP",239.75525268051393,2.1098462235885226E-2]
[null,null,null,null,null,null,"Dallas CZ2",0.13400000000000001,452,0.154,617,0.13400000000000001,517,0.154,676,null,null,null,null,null,null,null,null,null,null,null,null,"1: Winter peak demand developed by ICF"]
[null,null,null,null,null,null,"El Paso CZ5",0.106,312,0.126,479,0.106,338,0.126,501]
[]
[null,null,null,null,null,null,null,"Table 261. Lodging Occupancy Sensors—Dormitory per Room Energy and Peak Demand Savings"]
[null,null,null,null,null,null,null,"Heat Pump",null,null,null,"Electric Resistance"]
[null,null,null,null,null,null,null,"5-degree setup/setback offset"]
[null,null,null,null,null,null,null,"HVAC only",null,"HVAC and lighting",null,"HVAC only",null,"HVAC and lighting"]
[null,null,null,null,null,null,null,"kW","kWh","kW","kWh","kW","kWh","kW","kWh"]
[null,null,null,null,null,null,"Dallas CZ2",4.8000000000000001E-2,214,7.5999999999999998E-2,425,4.8000000000000001E-2,223,7.5999999999999998E-2,428]
[null,null,null,null,null,null,"El Paso CZ5",3.1E-2,110,5.8999999999999997E-2,327,3.1E-2,110,5.8999999999999997E-2,326]
[null,null,null,null,null,null,null,"10-degree setup/setback offset"]
[null,null,null,null,null,null,null,"HVAC only",null,"HVAC and lighting",null,"HVAC only",null,"HVAC and lighting"]
[null,null,null,null,null,null,null,"kW","kWh","kW","kWh","kW","kWh","kW","kWh"]
[null,null,null,null,null,null,"Dallas CZ2",7.8E-2,293,0.105,505,7.8E-2,304,0.105,511]
[null,null,null,null,null,null,"El Paso CZ5",4.4999999999999998E-2,151,0.06,448,4.4999999999999998E-2,153,0.06,450]
[]
[null,null,null,null,null,null,null,null,"CDD65","Ratio of Avg. SC CDD/TX CDD"]
["Assuming:","sqft per hotel room","sqft per motel room",null,null,null,null,"Dallas",2830,{"$f":"I48/I44","v":0.7920494699646643}]
[null,420,350,null,null,null,null,"El Paso",2446,{"$f":"I48/I45","v":0.91639411283728534}]
[null,null,null,null,null,null,null,"Charleston",2328]
[null,null,null,null,null,null,null,"Columbia",2155]
[null,null,null,null,null,null,null,"Avg. SC ",{"$f":"AVERAGE(I46:I47)","v":2241.5}]

{"sheet":"Advanced RTU Controls","index":21,"n_rows":30,"n_cols":19,"rows_kept":30,"cut":false,"hidden":false,"merged":[[0,0,0,11],[2,0,2,11],[3,0,3,11],[4,0,4,11],[26,0,26,10]]}
["Fill in Blue Cells Only!"]
[]
["ADVANCED RTU CONTROLS (ARC) TECHNICAL REQUIREMENTS AND INCENTIVES"]
["To qualify for an incentive:\n▪ Advanced control systems must be installed on existing packaged rooftop units serving constant volume HVAC systems.\n▪ Existing rooftop units must be air-cooled and utilize direct expansion (DX) cooling technology.\n▪ Existing rooftop units must have a functional economizer.\n▪ Existing rooftop units must be 3 nominal tons or higher to qualify.\n▪ The following are not eligible:\n   ▪ Advanced control systems installed on new packaged rooftop units\n   ▪ Advanced control systems installed on existing variable-air-volume (VAV) distribution systems\n   ▪ Advanced controls installed on split DX cooling systems (the condenser and compressor are packaged separately from the evaporator)\n   ▪ Packaged equipment with single-phase supply fans\n▪ Qualifying advanced rooftop unit controls must meet one of the three configurations below:\n   ▪ 1 - Demand Controlled Ventilation (DCV) Only\n   ▪ 2 - DCV and 2-speed fan control\n   ▪ 3 - DCV and multi-speed fan control\nWorkbook Instructions:\n▪ All blue cells must be filled in to calculate qualification. \n▪ For the equipment name in Column F, enter the name of the unit(s) or area(s) served if equipment doesn't have a name/tag.\n"]
["Advanced Rooftop Unit Controls"]
["Business Type","ARC Manufacturer","ARC Model","Control Methodology","Heating Fuel","Controlled HVAC Equipment Name(s)","Heating Capacity (BTU/hr)","Cooling Capacity (BTU/hr)","Quantity of units","Incentive Rate","Qualifies","Total Incentive",null,null,null,"Incentive Per unit","kWh","Winter kW","Total Incentive"]
[null,null,null,null,null,null,null,null,null,{"$f":"\"$\"&'ARC Validation'!$J$13&\"/unit\"","v":"$350/unit"},{"$f":"'ARC Calculations'!U9","v":""},{"$f":"S7","v":0},null,null,null,{"$f":"IFERROR(S7/I7,0)","v":0},{"$f":"'ARC Calculations'!W9","v":0},{"$f":"'ARC Calculations'!X9","v":0},{"$f":"'ARC Calculations'!Y9","v":0}]
[null,null,null,null,null,null,null,null,null,{"$f":"\"$\"&'ARC Validation'!$J$13&\"/unit\"","v":"$350/unit"},{"$f":"'ARC Calculations'!U10","v":""},{"$f":"S8","v":0},null,null,null,{"$f":"IFERROR(S8/I8,0)","v":0},{"$f":"'ARC Calculations'!W10","v":0},{"$f":"'ARC Calculations'!X10","v":0},{"$f":"'ARC Calculations'!Y10","v":0}]
[null,null,null,null,null,null,null,null,null,{"$f":"\"$\"&'ARC Validation'!$J$13&\"/unit\"","v":"$350/unit"},{"$f":"'ARC Calculations'!U11","v":""},0,null,null,null,0,{"$f":"'ARC Calculations'!W11","v":0},{"$f":"'ARC Calculations'!X11","v":0},{"$f":"'ARC Calculations'!Y11","v":0}]
[null,null,null,null,null,null,null,null,null,{"$f":"\"$\"&'ARC Validation'!$J$13&\"/unit\"","v":"$350/unit"},{"$f":"'ARC Calculations'!U12","v":""},0,null,null,null,0,{"$f":"'ARC Calculations'!W12","v":0},{"$f":"'ARC Calculations'!X12","v":0},{"$f":"'ARC Calculations'!Y12","v":0}]
[null,null,null,null,null,null,null,null,null,{"$f":"\"$\"&'ARC Validation'!$J$13&\"/unit\"","v":"$350/unit"},{"$f":"'ARC Calculations'!U13","v":""},0,null,null,null,0,{"$f":"'ARC Calculations'!W13","v":0},{"$f":"'ARC Calculations'!X13","v":0},{"$f":"'ARC Calculations'!Y13","v":0}]
[null,null,null,null,null,null,null,null,null,{"$f":"\"$\"&'ARC Validation'!$J$13&\"/unit\"","v":"$350/unit"},{"$f":"'ARC Calculations'!U14","v":""},0,null,null,null,0,{"$f":"'ARC Calculations'!W14","v":0},{"$f":"'ARC Calculations'!X14","v":0},{"$f":"'ARC Calculations'!Y14","v":0}]
[null,null,null,null,null,null,null,null,null,{"$f":"\"$\"&'ARC Validation'!$J$13&\"/unit\"","v":"$350/unit"},{"$f":"'ARC Calculations'!U15","v":""},0,null,null,null,0,{"$f":"'ARC Calculations'!W15","v":0},{"$f":"'ARC Calculations'!X15","v":0},{"$f":"'ARC Calculations'!Y15","v":0}]
[null,null,null,null,null,null,null,null,null,{"$f":"\"$\"&'ARC Validation'!$J$13&\"/unit\"","v":"$350/unit"},{"$f":"'ARC Calculations'!U16","v":""},0,null,null,null,0,{"$f":"'ARC Calculations'!W16","v":0},{"$f":"'ARC Calculations'!X16","v":0},{"$f":"'ARC Calculations'!Y16","v":0}]
[null,null,null,null,null,null,null,null,null,{"$f":"\"$\"&'ARC Validation'!$J$13&\"/unit\"","v":"$350/unit"},{"$f":"'ARC Calculations'!U17","v":""},0,null,null,null,0,{"$f":"'ARC Calculations'!W17","v":0},{"$f":"'ARC Calculations'!X17","v":0},{"$f":"'ARC Calculations'!Y17","v":0}]
[null,null,null,null,null,null,null,null,null,{"$f":"\"$\"&'ARC Validation'!$J$13&\"/unit\"","v":"$350/unit"},{"$f":"'ARC Calculations'!U18","v":""},0,null,null,null,0,{"$f":"'ARC Calculations'!W18","v":0},{"$f":"'ARC Calculations'!X18","v":0},{"$f":"'ARC Calculations'!Y18","v":0}]
[null,null,null,null,null,null,null,null,null,{"$f":"\"$\"&'ARC Validation'!$J$13&\"/unit\"","v":"$350/unit"},{"$f":"'ARC Calculations'!U19","v":""},0,null,null,null,0,{"$f":"'ARC Calculations'!W19","v":0},{"$f":"'ARC Calculations'!X19","v":0},{"$f":"'ARC Calculations'!Y19","v":0}]
[null,null,null,null,null,null,null,null,null,{"$f":"\"$\"&'ARC Validation'!$J$13&\"/unit\"","v":"$350/unit"},{"$f":"'ARC Calculations'!U20","v":""},0,null,null,null,0,{"$f":"'ARC Calculations'!W20","v":0},{"$f":"'ARC Calculations'!X20","v":0},{"$f":"'ARC Calculations'!Y20","v":0}]
[null,null,null,null,null,null,null,null,null,{"$f":"\"$\"&'ARC Validation'!$J$13&\"/unit\"","v":"$350/unit"},{"$f":"'ARC Calculations'!U21","v":""},0,null,null,null,0,{"$f":"'ARC Calculations'!W21","v":0},{"$f":"'ARC Calculations'!X21","v":0},{"$f":"'ARC Calculations'!Y21","v":0}]
[null,null,null,null,null,null,null,null,null,{"$f":"\"$\"&'ARC Validation'!$J$13&\"/unit\"","v":"$350/unit"},{"$f":"'ARC Calculations'!U22","v":""},0,null,null,null,0,{"$f":"'ARC Calculations'!W22","v":0},{"$f":"'ARC Calculations'!X22","v":0},{"$f":"'ARC Calculations'!Y22","v":0}]
[null,null,null,null,null,null,null,null,null,{"$f":"\"$\"&'ARC Validation'!$J$13&\"/unit\"","v":"$350/unit"},{"$f":"'ARC Calculations'!U23","v":""},0,null,null,null,0,{"$f":"'ARC Calculations'!W23","v":0},{"$f":"'ARC Calculations'!X23","v":0},{"$f":"'ARC Calculations'!Y23","v":0}]
[null,null,null,null,null,null,null,null,null,{"$f":"\"$\"&'ARC Validation'!$J$13&\"/unit\"","v":"$350/unit"},{"$f":"'ARC Calculations'!U24","v":""},0,null,null,null,0,{"$f":"'ARC Calculations'!W24","v":0},{"$f":"'ARC Calculations'!X24","v":0},{"$f":"'ARC Calculations'!Y24","v":0}]
[null,null,null,null,null,null,null,null,null,{"$f":"\"$\"&'ARC Validation'!$J$13&\"/unit\"","v":"$350/unit"},{"$f":"'ARC Calculations'!U25","v":""},0,null,null,null,0,{"$f":"'ARC Calculations'!W25","v":0},{"$f":"'ARC Calculations'!X25","v":0},{"$f":"'ARC Calculations'!Y25","v":0}]
[null,null,null,null,null,null,null,null,null,{"$f":"\"$\"&'ARC Validation'!$J$13&\"/unit\"","v":"$350/unit"},{"$f":"'ARC Calculations'!U26","v":""},0,null,null,null,0,{"$f":"'ARC Calculations'!W26","v":0},{"$f":"'ARC Calculations'!X26","v":0},{"$f":"'ARC Calculations'!Y26","v":0}]
[null,null,null,null,null,null,null,null,null,{"$f":"\"$\"&'ARC Validation'!$J$13&\"/unit\"","v":"$350/unit"},{"$f":"'ARC Calculations'!U27","v":""},0,null,null,null,0,{"$f":"'ARC Calculations'!W27","v":0},{"$f":"'ARC Calculations'!X27","v":0},{"$f":"'ARC Calculations'!Y27","v":0}]
[null,null,null,null,null,null,null,null,null,{"$f":"\"$\"&'ARC Validation'!$J$13&\"/unit\"","v":"$350/unit"},{"$f":"'ARC Calculations'!U28","v":""},0,null,null,null,0,{"$f":"'ARC Calculations'!W28","v":0},{"$f":"'ARC Calculations'!X28","v":0},{"$f":"'ARC Calculations'!Y28","v":0}]
["Total Requested Incentive",null,null,null,null,null,null,null,null,null,null,{"$f":"SUM(L7:L26)","v":0}]
[null,null,null,null,null,null,null,null,null,"Error Messages:"]
[null,null,null,null,null,null,null,null,1,{"$f":"_xlfn.XLOOKUP(I29,'ARC Validation'!$A$53:$A$55,'ARC Validation'!$C$53:$C$55)","v":"No. Please fill in all blue cells."},null,{"$f":"\"Version \"  &  'Version Tracking'!C4","v":"Version 15.2"}]
[null,null,null,null,null,null,null,null,2,{"$f":"_xlfn.XLOOKUP(I30,'ARC Validation'!$A$53:$A$55,'ARC Validation'!$C$53:$C$55)","v":"No. Please fill in zip code on Project Information tab"}]

{"sheet":"ARC Calculations","index":22,"n_rows":28,"n_cols":29,"rows_kept":28,"cut":false,"hidden":true,"merged":[[5,17,5,19],[6,22,6,24]]}
[]
[]
[]
[]
[]
[null,null,null,null,null,null,null,null,null,null,"Zip Code",null,null,null,null,null,null,"Error Message"]
[null,null,null,null,null,null,null,null,null,null,{"$f":"'Project Information'!N6","v":0},null,null,null,null,null,null,1,2,0,null,null,"Totals"]
["Business Type","ARC Manufacturer","ARC Model","Control Methodology","Heating Fuel","Controlled HVAC Equipment Name(s)","Heating Capacity (BTU/hr)","Cooling Capacity (BTU/hr)","Quantity","Control Method","City","Heating Type","ER Heating kWh/ton","HP Heating kWh/ton","Heating kWh savings/ton","Cooling kWh savings/ton","Winter Demand kW/kWh","All blue cells filled in?","Zip Code filled in?","Result","Qualifies","Unit Incentive","Total kWh Savings","Total Winter kW Savings","Total Incentive","Total kWh Savings per unit","Total Winter kW Savings per unit",null,"$/kWh"]
[{"$f":"'Advanced RTU Controls'!A7","v":0},{"$f":"'Advanced RTU Controls'!B7","v":0},{"$f":"'Advanced RTU Controls'!C7","v":0},{"$f":"'Advanced RTU Controls'!D7","v":0},{"$f":"'Advanced RTU Controls'!E7","v":0},{"$f":"'Advanced RTU Controls'!F7","v":0},{"$f":"'Advanced RTU Controls'!G7","v":0},{"$f":"'Advanced RTU Controls'!H7","v":0},{"$f":"'Advanced RTU Controls'!I7","v":0},{"$f":"_xlfn.XLOOKUP(D9,ControlMethod,'ARC Validation'!$M$2:$M$4)","v":{"$error":"#N/A"}},{"$f":"IFERROR(_xlfn.XLOOKUP($K$7,Validation!$B$116:$B$515,Validation!$D$116:$D$515),0)","v":0},{"$f":"_xlfn.XLOOKUP(E9,HtgType,'ARC Validation'!$P$2:$P$4)","v":{"$error":"#N/A"}},{"$f":"IF(OR(E9=0,E9=\"Other\"),0,IF(K9=\"Charleston\",INDEX('ARC Validation'!$B$20:$D$32,MATCH(A9,ARCBusType,0),MATCH(J9,'ARC Validation'!$B$2:$D$2,0)),IF(K9=\"Columbia\",INDEX('ARC Validation'!$E$20:$G$32,MATCH(A9,ARCBusType,0),MATCH(J9,'ARC Validation'!$B$2:$D$2,0)))))","v":0},{"$f":"IF(OR(E9=0,E9=\"Other\"),0,IF(K9=\"Charleston\",INDEX('ARC Validation'!$B$3:$D$15,MATCH(A9,ARCBusType,0),MATCH(J9,'ARC Validation'!$B$2:$D$2,0)),IF(K9=\"Columbia\",INDEX('ARC Validation'!$E$3:$G$15,MATCH(A9,ARCBusType,0),MATCH(J9,'ARC Validation'!$B$2:$D$2,0)))))","v":0},{"$f":"IF(L9=1,M9,IF(L9=2,N9,0))","v":{"$error":"#N/A"}},{"$f":"IF(K9=\"Charleston\",INDEX('ARC Validation'!$B$37:$D$49,MATCH(A9,ARCBusType,0),MATCH(J9,'ARC Validation'!$B$2:$D$2,0)),IF(K9=\"Columbia\",INDEX('ARC Validation'!$E$37:$G$49,MATCH(A9,ARCBusType,0),MATCH(J9,'ARC Validation'!$B$2:$D$2,0))))","v":false},{"$f":"_xlfn.XLOOKUP(J9,'ARC Validation'!$J$8:$J$10,'ARC Validation'!$I$8:$I$10)","v":{"$error":"#N/A"}},{"$f":"IF(AND(A9<>0,B9<>0,C9<>0,D9<>0,E9<>0,F9<>0,G9<>0,H9<>0,I9<>0),\"Yes\",\"No\")","v":"No"},{"$f":"IF(OR(K9=\"Charleston\",K9=\"Columbia\"),\"Yes\",\"No\")","v":"No"},{"$f":"IF(R9=\"Yes\",IF(S9=\"Yes\",0,$S$7),$R$7)","v":1},{"$f":"IF(SUM(A9:I9)=0,\"\",_xlfn.XLOOKUP(T9,'ARC Validation'!$A$53:$A$55,'ARC Validation'!$B$53:$B$55))","v":""},{"$f":"IF(U9=\"Yes\",'ARC Validation'!$J$13,0)","v":0},{"$f":"IF($U9=\"Yes\",(O9*G9/12000+P9*H9/12000)*I9,0)","v":0},{"$f":"IF(U9=\"Yes\",W9*Q9,0)","v":0},{"$f":"IF(U9=\"Yes\",I9*V9,0)","v":0},{"$f":"W9/I9","v":{"$error":"#DIV/0!"}},{"$f":"X9/I9","v":{"$error":"#DIV/0!"}},null,{"$f":"Y9/W9","v":{"$error":"#DIV/0!"}}]
[{"$f":"'Advanced RTU Controls'!A8","v":0},{"$f":"'Advanced RTU Controls'!B8","v":0},{"$f":"'Advanced RTU Controls'!C8","v":0},{"$f":"'Advanced RTU Controls'!D8","v":0},{"$f":"'Advanced RTU Controls'!E8","v":0},{"$f":"'Advanced RTU Controls'!F8","v":0},{"$f":"'Advanced RTU Controls'!G8","v":0},{"$f":"'Advanced RTU Controls'!H8","v":0},{"$f":"'Advanced RTU Controls'!I8","v":0},{"$f":"_xlfn.XLOOKUP(D10,ControlMethod,'ARC Validation'!$M$2:$M$4)","v":{"$error":"#N/A"}},{"$f":"IFERROR(_xlfn.XLOOKUP($K$7,Validation!$B$116:$B$515,Validation!$D$116:$D$515),0)","v":0},{"$f":"_xlfn.XLOOKUP(E10,HtgType,'ARC Validation'!$P$2:$P$4)","v":{"$error":"#N/A"}},{"$f":"IF(OR(E10=0,E10=\"Other\"),0,IF(K10=\"Charleston\",INDEX('ARC Validation'!$B$20:$D$32,MATCH(A10,ARCBusType,0),MATCH(J10,'ARC Validation'!$B$2:$D$2,0)),IF(K10=\"Columbia\",INDEX('ARC Validation'!$E$20:$G$32,MATCH(A10,ARCBusType,0),MATCH(J10,'ARC Validation'!$B$2:$D$2,0)))))","v":0},{"$f":"IF(OR(E10=0,E10=\"Other\"),0,IF(K10=\"Charleston\",INDEX('ARC Validation'!$B$3:$D$15,MATCH(A10,ARCBusType,0),MATCH(J10,'ARC Validation'!$B$2:$D$2,0)),IF(K10=\"Columbia\",INDEX('ARC Validation'!$E$3:$G$15,MATCH(A10,ARCBusType,0),MATCH(J10,'ARC Validation'!$B$2:$D$2,0)))))","v":0},{"$f":"IF(L10=1,M10,IF(L10=2,N10,0))","v":{"$error":"#N/A"}},{"$f":"IF(K10=\"Charleston\",INDEX('ARC Validation'!$B$37:$D$49,MATCH(A10,ARCBusType,0),MATCH(J10,'ARC Validation'!$B$2:$D$2,0)),IF(K10=\"Columbia\",INDEX('ARC Validation'!$E$37:$G$49,MATCH(A10,ARCBusType,0),MATCH(J10,'ARC Validation'!$B$2:$D$2,0))))","v":false},{"$f":"_xlfn.XLOOKUP(J10,'ARC Validation'!$J$8:$J$10,'ARC Validation'!$I$8:$I$10)","v":{"$error":"#N/A"}},"No","No",{"$f":"IF(R10=\"Yes\",IF(S10=\"Yes\",0,$S$7),$R$7)","v":1},{"$f":"IF(SUM(A10:I10)=0,\"\",_xlfn.XLOOKUP(T10,'ARC Validation'!$A$53:$A$55,'ARC Validation'!$B$53:$B$55))","v":""},{"$f":"IF(U10=\"Yes\",'ARC Validation'!$J$13,0)","v":0},0,0,0,{"$f":"W10/I10","v":{"$error":"#DIV/0!"}},{"$f":"X10/I10","v":{"$error":"#DIV/0!"}},null,{"$f":"Y10/W10","v":{"$error":"#DIV/0!"}}]
[{"$f":"'Advanced RTU Controls'!A9","v":0},{"$f":"'Advanced RTU Controls'!B9","v":0},{"$f":"'Advanced RTU Controls'!C9","v":0},{"$f":"'Advanced RTU Controls'!D9","v":0},{"$f":"'Advanced RTU Controls'!E9","v":0},{"$f":"'Advanced RTU Controls'!F9","v":0},{"$f":"'Advanced RTU Controls'!G9","v":0},{"$f":"'Advanced RTU Controls'!H9","v":0},{"$f":"'Advanced RTU Controls'!I9","v":0},{"$f":"_xlfn.XLOOKUP(D11,ControlMethod,'ARC Validation'!$M$2:$M$4)","v":{"$error":"#N/A"}},{"$f":"IFERROR(_xlfn.XLOOKUP($K$7,Validation!$B$116:$B$515,Validation!$D$116:$D$515),0)","v":0},{"$f":"_xlfn.XLOOKUP(E11,HtgType,'ARC Validation'!$P$2:$P$4)","v":{"$error":"#N/A"}},{"$f":"IF(OR(E11=0,E11=\"Other\"),0,IF(K11=\"Charleston\",INDEX('ARC Validation'!$B$20:$D$32,MATCH(A11,ARCBusType,0),MATCH(J11,'ARC Validation'!$B$2:$D$2,0)),IF(K11=\"Columbia\",INDEX('ARC Validation'!$E$20:$G$32,MATCH(A11,ARCBusType,0),MATCH(J11,'ARC Validation'!$B$2:$D$2,0)))))","v":0},{"$f":"IF(OR(E11=0,E11=\"Other\"),0,IF(K11=\"Charleston\",INDEX('ARC Validation'!$B$3:$D$15,MATCH(A11,ARCBusType,0),MATCH(J11,'ARC Validation'!$B$2:$D$2,0)),IF(K11=\"Columbia\",INDEX('ARC Validation'!$E$3:$G$15,MATCH(A11,ARCBusType,0),MATCH(J11,'ARC Validation'!$B$2:$D$2,0)))))","v":0},{"$error":"#N/A"},{"$f":"IF(K11=\"Charleston\",INDEX('ARC Validation'!$B$37:$D$49,MATCH(A11,ARCBusType,0),MATCH(J11,'ARC Validation'!$B$2:$D$2,0)),IF(K11=\"Columbia\",INDEX('ARC Validation'!$E$37:$G$49,MATCH(A11,ARCBusType,0),MATCH(J11,'ARC Validation'!$B$2:$D$2,0))))","v":false},{"$f":"_xlfn.XLOOKUP(J11,'ARC Validation'!$J$8:$J$10,'ARC Validation'!$I$8:$I$10)","v":{"$error":"#N/A"}},"No","No",1,{"$f":"IF(SUM(A11:I11)=0,\"\",_xlfn.XLOOKUP(T11,'ARC Validation'!$A$53:$A$55,'ARC Validation'!$B$53:$B$55))","v":""},{"$f":"IF(U11=\"Yes\",'ARC Validation'!$J$13,0)","v":0},0,0,0,{"$error":"#DIV/0!"},{"$error":"#DIV/0!"},null,{"$error":"#DIV/0!"}]
[{"$f":"'Advanced RTU Controls'!A10","v":0},{"$f":"'Advanced RTU Controls'!B10","v":0},{"$f":"'Advanced RTU Controls'!C10","v":0},{"$f":"'Advanced RTU Controls'!D10","v":0},{"$f":"'Advanced RTU Controls'!E10","v":0},{"$f":"'Advanced RTU Controls'!F10","v":0},{"$f":"'Advanced RTU Controls'!G10","v":0},{"$f":"'Advanced RTU Controls'!H10","v":0},{"$f":"'Advanced RTU Controls'!I10","v":0},{"$f":"_xlfn.XLOOKUP(D12,ControlMethod,'ARC Validation'!$M$2:$M$4)","v":{"$error":"#N/A"}},{"$f":"IFERROR(_xlfn.XLOOKUP($K$7,Validation!$B$116:$B$515,Validation!$D$116:$D$515),0)","v":0},{"$f":"_xlfn.XLOOKUP(E12,HtgType,'ARC Validation'!$P$2:$P$4)","v":{"$error":"#N/A"}},{"$f":"IF(OR(E12=0,E12=\"Other\"),0,IF(K12=\"Charleston\",INDEX('ARC Validation'!$B$20:$D$32,MATCH(A12,ARCBusType,0),MATCH(J12,'ARC Validation'!$B$2:$D$2,0)),IF(K12=\"Columbia\",INDEX('ARC Validation'!$E$20:$G$32,MATCH(A12,ARCBusType,0),MATCH(J12,'ARC Validation'!$B$2:$D$2,0)))))","v":0},{"$f":"IF(OR(E12=0,E12=\"Other\"),0,IF(K12=\"Charleston\",INDEX('ARC Validation'!$B$3:$D$15,MATCH(A12,ARCBusType,0),MATCH(J12,'ARC Validation'!$B$2:$D$2,0)),IF(K12=\"Columbia\",INDEX('ARC Validation'!$E$3:$G$15,MATCH(A12,ARCBusType,0),MATCH(J12,'ARC Validation'!$B$2:$D$2,0)))))","v":0},{"$error":"#N/A"},{"$f":"IF(K12=\"Charleston\",INDEX('ARC Validation'!$B$37:$D$49,MATCH(A12,ARCBusType,0),MATCH(J12,'ARC Validation'!$B$2:$D$2,0)),IF(K12=\"Columbia\",INDEX('ARC Validation'!$E$37:$G$49,MATCH(A12,ARCBusType,0),MATCH(J12,'ARC Validation'!$B$2:$D$2,0))))","v":false},{"$f":"_xlfn.XLOOKUP(J12,'ARC Validation'!$J$8:$J$10,'ARC Validation'!$I$8:$I$10)","v":{"$error":"#N/A"}},"No","No",1,{"$f":"IF(SUM(A12:I12)=0,\"\",_xlfn.XLOOKUP(T12,'ARC Validation'!$A$53:$A$55,'ARC Validation'!$B$53:$B$55))","v":""},{"$f":"IF(U12=\"Yes\",'ARC Validation'!$J$13,0)","v":0},0,0,0,{"$error":"#DIV/0!"},{"$error":"#DIV/0!"},null,{"$error":"#DIV/0!"}]
[{"$f":"'Advanced RTU Controls'!A11","v":0},{"$f":"'Advanced RTU Controls'!B11","v":0},{"$f":"'Advanced RTU Controls'!C11","v":0},{"$f":"'Advanced RTU Controls'!D11","v":0},{"$f":"'Advanced RTU Controls'!E11","v":0},{"$f":"'Advanced RTU Controls'!F11","v":0},{"$f":"'Advanced RTU Controls'!G11","v":0},{"$f":"'Advanced RTU Controls'!H11","v":0},{"$f":"'Advanced RTU Controls'!I11","v":0},{"$f":"_xlfn.XLOOKUP(D13,ControlMethod,'ARC Validation'!$M$2:$M$4)","v":{"$error":"#N/A"}},{"$f":"IFERROR(_xlfn.XLOOKUP($K$7,Validation!$B$116:$B$515,Validation!$D$116:$D$515),0)","v":0},{"$f":"_xlfn.XLOOKUP(E13,HtgType,'ARC Validation'!$P$2:$P$4)","v":{"$error":"#N/A"}},{"$f":"IF(OR(E13=0,E13=\"Other\"),0,IF(K13=\"Charleston\",INDEX('ARC Validation'!$B$20:$D$32,MATCH(A13,ARCBusType,0),MATCH(J13,'ARC Validation'!$B$2:$D$2,0)),IF(K13=\"Columbia\",INDEX('ARC Validation'!$E$20:$G$32,MATCH(A13,ARCBusType,0),MATCH(J13,'ARC Validation'!$B$2:$D$2,0)))))","v":0},{"$f":"IF(OR(E13=0,E13=\"Other\"),0,IF(K13=\"Charleston\",INDEX('ARC Validation'!$B$3:$D$15,MATCH(A13,ARCBusType,0),MATCH(J13,'ARC Validation'!$B$2:$D$2,0)),IF(K13=\"Columbia\",INDEX('ARC Validation'!$E$3:$G$15,MATCH(A13,ARCBusType,0),MATCH(J13,'ARC Validation'!$B$2:$D$2,0)))))","v":0},{"$error":"#N/A"},{"$f":"IF(K13=\"Charleston\",INDEX('ARC Validation'!$B$37:$D$49,MATCH(A13,ARCBusType,0),MATCH(J13,'ARC Validation'!$B$2:$D$2,0)),IF(K13=\"Columbia\",INDEX('ARC Validation'!$E$37:$G$49,MATCH(A13,ARCBusType,0),MATCH(J13,'ARC Validation'!$B$2:$D$2,0))))","v":false},{"$f":"_xlfn.XLOOKUP(J13,'ARC Validation'!$J$8:$J$10,'ARC Validation'!$I$8:$I$10)","v":{"$error":"#N/A"}},"No","No",1,{"$f":"IF(SUM(A13:I13)=0,\"\",_xlfn.XLOOKUP(T13,'ARC Validation'!$A$53:$A$55,'ARC Validation'!$B$53:$B$55))","v":""},{"$f":"IF(U13=\"Yes\",'ARC Validation'!$J$13,0)","v":0},0,0,0,{"$error":"#DIV/0!"},{"$error":"#DIV/0!"},null,{"$error":"#DIV/0!"}]
[{"$f":"'Advanced RTU Controls'!A12","v":0},{"$f":"'Advanced RTU Controls'!B12","v":0},{"$f":"'Advanced RTU Controls'!C12","v":0},{"$f":"'Advanced RTU Controls'!D12","v":0},{"$f":"'Advanced RTU Controls'!E12","v":0},{"$f":"'Advanced RTU Controls'!F12","v":0},{"$f":"'Advanced RTU Controls'!G12","v":0},{"$f":"'Advanced RTU Controls'!H12","v":0},{"$f":"'Advanced RTU Controls'!I12","v":0},{"$f":"_xlfn.XLOOKUP(D14,ControlMethod,'ARC Validation'!$M$2:$M$4)","v":{"$error":"#N/A"}},{"$f":"IFERROR(_xlfn.XLOOKUP($K$7,Validation!$B$116:$B$515,Validation!$D$116:$D$515),0)","v":0},{"$f":"_xlfn.XLOOKUP(E14,HtgType,'ARC Validation'!$P$2:$P$4)","v":{"$error":"#N/A"}},{"$f":"IF(OR(E14=0,E14=\"Other\"),0,IF(K14=\"Charleston\",INDEX('ARC Validation'!$B$20:$D$32,MATCH(A14,ARCBusType,0),MATCH(J14,'ARC Validation'!$B$2:$D$2,0)),IF(K14=\"Columbia\",INDEX('ARC Validation'!$E$20:$G$32,MATCH(A14,ARCBusType,0),MATCH(J14,'ARC Validation'!$B$2:$D$2,0)))))","v":0},{"$f":"IF(OR(E14=0,E14=\"Other\"),0,IF(K14=\"Charleston\",INDEX('ARC Validation'!$B$3:$D$15,MATCH(A14,ARCBusType,0),MATCH(J14,'ARC Validation'!$B$2:$D$2,0)),IF(K14=\"Columbia\",INDEX('ARC Validation'!$E$3:$G$15,MATCH(A14,ARCBusType,0),MATCH(J14,'ARC Validation'!$B$2:$D$2,0)))))","v":0},{"$error":"#N/A"},{"$f":"IF(K14=\"Charleston\",INDEX('ARC Validation'!$B$37:$D$49,MATCH(A14,ARCBusType,0),MATCH(J14,'ARC Validation'!$B$2:$D$2,0)),IF(K14=\"Columbia\",INDEX('ARC Validation'!$E$37:$G$49,MATCH(A14,ARCBusType,0),MATCH(J14,'ARC Validation'!$B$2:$D$2,0))))","v":false},{"$f":"_xlfn.XLOOKUP(J14,'ARC Validation'!$J$8:$J$10,'ARC Validation'!$I$8:$I$10)","v":{"$error":"#N/A"}},"No","No",1,{"$f":"IF(SUM(A14:I14)=0,\"\",_xlfn.XLOOKUP(T14,'ARC Validation'!$A$53:$A$55,'ARC Validation'!$B$53:$B$55))","v":""},{"$f":"IF(U14=\"Yes\",'ARC Validation'!$J$13,0)","v":0},0,0,0,{"$error":"#DIV/0!"},{"$error":"#DIV/0!"},null,{"$error":"#DIV/0!"}]
[{"$f":"'Advanced RTU Controls'!A13","v":0},{"$f":"'Advanced RTU Controls'!B13","v":0},{"$f":"'Advanced RTU Controls'!C13","v":0},{"$f":"'Advanced RTU Controls'!D13","v":0},{"$f":"'Advanced RTU Controls'!E13","v":0},{"$f":"'Advanced RTU Controls'!F13","v":0},{"$f":"'Advanced RTU Controls'!G13","v":0},{"$f":"'Advanced RTU Controls'!H13","v":0},{"$f":"'Advanced RTU Controls'!I13","v":0},{"$f":"_xlfn.XLOOKUP(D15,ControlMethod,'ARC Validation'!$M$2:$M$4)","v":{"$error":"#N/A"}},{"$f":"IFERROR(_xlfn.XLOOKUP($K$7,Validation!$B$116:$B$515,Validation!$D$116:$D$515),0)","v":0},{"$f":"_xlfn.XLOOKUP(E15,HtgType,'ARC Validation'!$P$2:$P$4)","v":{"$error":"#N/A"}},{"$f":"IF(OR(E15=0,E15=\"Other\"),0,IF(K15=\"Charleston\",INDEX('ARC Validation'!$B$20:$D$32,MATCH(A15,ARCBusType,0),MATCH(J15,'ARC Validation'!$B$2:$D$2,0)),IF(K15=\"Columbia\",INDEX('ARC Validation'!$E$20:$G$32,MATCH(A15,ARCBusType,0),MATCH(J15,'ARC Validation'!$B$2:$D$2,0)))))","v":0},{"$f":"IF(OR(E15=0,E15=\"Other\"),0,IF(K15=\"Charleston\",INDEX('ARC Validation'!$B$3:$D$15,MATCH(A15,ARCBusType,0),MATCH(J15,'ARC Validation'!$B$2:$D$2,0)),IF(K15=\"Columbia\",INDEX('ARC Validation'!$E$3:$G$15,MATCH(A15,ARCBusType,0),MATCH(J15,'ARC Validation'!$B$2:$D$2,0)))))","v":0},{"$error":"#N/A"},{"$f":"IF(K15=\"Charleston\",INDEX('ARC Validation'!$B$37:$D$49,MATCH(A15,ARCBusType,0),MATCH(J15,'ARC Validation'!$B$2:$D$2,0)),IF(K15=\"Columbia\",INDEX('ARC Validation'!$E$37:$G$49,MATCH(A15,ARCBusType,0),MATCH(J15,'ARC Validation'!$B$2:$D$2,0))))","v":false},{"$f":"_xlfn.XLOOKUP(J15,'ARC Validation'!$J$8:$J$10,'ARC Validation'!$I$8:$I$10)","v":{"$error":"#N/A"}},"No","No",1,{"$f":"IF(SUM(A15:I15)=0,\"\",_xlfn.XLOOKUP(T15,'ARC Validation'!$A$53:$A$55,'ARC Validation'!$B$53:$B$55))","v":""},{"$f":"IF(U15=\"Yes\",'ARC Validation'!$J$13,0)","v":0},0,0,0,{"$error":"#DIV/0!"},{"$error":"#DIV/0!"},null,{"$error":"#DIV/0!"}]
[{"$f":"'Advanced RTU Controls'!A14","v":0},{"$f":"'Advanced RTU Controls'!B14","v":0},{"$f":"'Advanced RTU Controls'!C14","v":0},{"$f":"'Advanced RTU Controls'!D14","v":0},{"$f":"'Advanced RTU Controls'!E14","v":0},{"$f":"'Advanced RTU Controls'!F14","v":0},{"$f":"'Advanced RTU Controls'!G14","v":0},{"$f":"'Advanced RTU Controls'!H14","v":0},{"$f":"'Advanced RTU Controls'!I14","v":0},{"$f":"_xlfn.XLOOKUP(D16,ControlMethod,'ARC Validation'!$M$2:$M$4)","v":{"$error":"#N/A"}},{"$f":"IFERROR(_xlfn.XLOOKUP($K$7,Validation!$B$116:$B$515,Validation!$D$116:$D$515),0)","v":0},{"$f":"_xlfn.XLOOKUP(E16,HtgType,'ARC Validation'!$P$2:$P$4)","v":{"$error":"#N/A"}},{"$f":"IF(OR(E16=0,E16=\"Other\"),0,IF(K16=\"Charleston\",INDEX('ARC Validation'!$B$20:$D$32,MATCH(A16,ARCBusType,0),MATCH(J16,'ARC Validation'!$B$2:$D$2,0)),IF(K16=\"Columbia\",INDEX('ARC Validation'!$E$20:$G$32,MATCH(A16,ARCBusType,0),MATCH(J16,'ARC Validation'!$B$2:$D$2,0)))))","v":0},{"$f":"IF(OR(E16=0,E16=\"Other\"),0,IF(K16=\"Charleston\",INDEX('ARC Validation'!$B$3:$D$15,MATCH(A16,ARCBusType,0),MATCH(J16,'ARC Validation'!$B$2:$D$2,0)),IF(K16=\"Columbia\",INDEX('ARC Validation'!$E$3:$G$15,MATCH(A16,ARCBusType,0),MATCH(J16,'ARC Validation'!$B$2:$D$2,0)))))","v":0},{"$error":"#N/A"},{"$f":"IF(K16=\"Charleston\",INDEX('ARC Validation'!$B$37:$D$49,MATCH(A16,ARCBusType,0),MATCH(J16,'ARC Validation'!$B$2:$D$2,0)),IF(K16=\"Columbia\",INDEX('ARC Validation'!$E$37:$G$49,MATCH(A16,ARCBusType,0),MATCH(J16,'ARC Validation'!$B$2:$D$2,0))))","v":false},{"$f":"_xlfn.XLOOKUP(J16,'ARC Validation'!$J$8:$J$10,'ARC Validation'!$I$8:$I$10)","v":{"$error":"#N/A"}},"No","No",1,{"$f":"IF(SUM(A16:I16)=0,\"\",_xlfn.XLOOKUP(T16,'ARC Validation'!$A$53:$A$55,'ARC Validation'!$B$53:$B$55))","v":""},{"$f":"IF(U16=\"Yes\",'ARC Validation'!$J$13,0)","v":0},0,0,0,{"$error":"#DIV/0!"},{"$error":"#DIV/0!"},null,{"$error":"#DIV/0!"}]
[{"$f":"'Advanced RTU Controls'!A15","v":0},{"$f":"'Advanced RTU Controls'!B15","v":0},{"$f":"'Advanced RTU Controls'!C15","v":0},{"$f":"'Advanced RTU Controls'!D15","v":0},{"$f":"'Advanced RTU Controls'!E15","v":0},{"$f":"'Advanced RTU Controls'!F15","v":0},{"$f":"'Advanced RTU Controls'!G15","v":0},{"$f":"'Advanced RTU Controls'!H15","v":0},{"$f":"'Advanced RTU Controls'!I15","v":0},{"$f":"_xlfn.XLOOKUP(D17,ControlMethod,'ARC Validation'!$M$2:$M$4)","v":{"$error":"#N/A"}},{"$f":"IFERROR(_xlfn.XLOOKUP($K$7,Validation!$B$116:$B$515,Validation!$D$116:$D$515),0)","v":0},{"$f":"_xlfn.XLOOKUP(E17,HtgType,'ARC Validation'!$P$2:$P$4)","v":{"$error":"#N/A"}},{"$f":"IF(OR(E17=0,E17=\"Other\"),0,IF(K17=\"Charleston\",INDEX('ARC Validation'!$B$20:$D$32,MATCH(A17,ARCBusType,0),MATCH(J17,'ARC Validation'!$B$2:$D$2,0)),IF(K17=\"Columbia\",INDEX('ARC Validation'!$E$20:$G$32,MATCH(A17,ARCBusType,0),MATCH(J17,'ARC Validation'!$B$2:$D$2,0)))))","v":0},{"$f":"IF(OR(E17=0,E17=\"Other\"),0,IF(K17=\"Charleston\",INDEX('ARC Validation'!$B$3:$D$15,MATCH(A17,ARCBusType,0),MATCH(J17,'ARC Validation'!$B$2:$D$2,0)),IF(K17=\"Columbia\",INDEX('ARC Validation'!$E$3:$G$15,MATCH(A17,ARCBusType,0),MATCH(J17,'ARC Validation'!$B$2:$D$2,0)))))","v":0},{"$error":"#N/A"},{"$f":"IF(K17=\"Charleston\",INDEX('ARC Validation'!$B$37:$D$49,MATCH(A17,ARCBusType,0),MATCH(J17,'ARC Validation'!$B$2:$D$2,0)),IF(K17=\"Columbia\",INDEX('ARC Validation'!$E$37:$G$49,MATCH(A17,ARCBusType,0),MATCH(J17,'ARC Validation'!$B$2:$D$2,0))))","v":false},{"$f":"_xlfn.XLOOKUP(J17,'ARC Validation'!$J$8:$J$10,'ARC Validation'!$I$8:$I$10)","v":{"$error":"#N/A"}},"No","No",1,{"$f":"IF(SUM(A17:I17)=0,\"\",_xlfn.XLOOKUP(T17,'ARC Validation'!$A$53:$A$55,'ARC Validation'!$B$53:$B$55))","v":""},{"$f":"IF(U17=\"Yes\",'ARC Validation'!$J$13,0)","v":0},0,0,0,{"$error":"#DIV/0!"},{"$error":"#DIV/0!"},null,{"$error":"#DIV/0!"}]
[{"$f":"'Advanced RTU Controls'!A16","v":0},{"$f":"'Advanced RTU Controls'!B16","v":0},{"$f":"'Advanced RTU Controls'!C16","v":0},{"$f":"'Advanced RTU Controls'!D16","v":0},{"$f":"'Advanced RTU Controls'!E16","v":0},{"$f":"'Advanced RTU Controls'!F16","v":0},{"$f":"'Advanced RTU Controls'!G16","v":0},{"$f":"'Advanced RTU Controls'!H16","v":0},{"$f":"'Advanced RTU Controls'!I16","v":0},{"$f":"_xlfn.XLOOKUP(D18,ControlMethod,'ARC Validation'!$M$2:$M$4)","v":{"$error":"#N/A"}},{"$f":"IFERROR(_xlfn.XLOOKUP($K$7,Validation!$B$116:$B$515,Validation!$D$116:$D$515),0)","v":0},{"$f":"_xlfn.XLOOKUP(E18,HtgType,'ARC Validation'!$P$2:$P$4)","v":{"$error":"#N/A"}},{"$f":"IF(OR(E18=0,E18=\"Other\"),0,IF(K18=\"Charleston\",INDEX('ARC Validation'!$B$20:$D$32,MATCH(A18,ARCBusType,0),MATCH(J18,'ARC Validation'!$B$2:$D$2,0)),IF(K18=\"Columbia\",INDEX('ARC Validation'!$E$20:$G$32,MATCH(A18,ARCBusType,0),MATCH(J18,'ARC Validation'!$B$2:$D$2,0)))))","v":0},{"$f":"IF(OR(E18=0,E18=\"Other\"),0,IF(K18=\"Charleston\",INDEX('ARC Validation'!$B$3:$D$15,MATCH(A18,ARCBusType,0),MATCH(J18,'ARC Validation'!$B$2:$D$2,0)),IF(K18=\"Columbia\",INDEX('ARC Validation'!$E$3:$G$15,MATCH(A18,ARCBusType,0),MATCH(J18,'ARC Validation'!$B$2:$D$2,0)))))","v":0},{"$error":"#N/A"},{"$f":"IF(K18=\"Charleston\",INDEX('ARC Validation'!$B$37:$D$49,MATCH(A18,ARCBusType,0),MATCH(J18,'ARC Validation'!$B$2:$D$2,0)),IF(K18=\"Columbia\",INDEX('ARC Validation'!$E$37:$G$49,MATCH(A18,ARCBusType,0),MATCH(J18,'ARC Validation'!$B$2:$D$2,0))))","v":false},{"$f":"_xlfn.XLOOKUP(J18,'ARC Validation'!$J$8:$J$10,'ARC Validation'!$I$8:$I$10)","v":{"$error":"#N/A"}},"No","No",1,{"$f":"IF(SUM(A18:I18)=0,\"\",_xlfn.XLOOKUP(T18,'ARC Validation'!$A$53:$A$55,'ARC Validation'!$B$53:$B$55))","v":""},{"$f":"IF(U18=\"Yes\",'ARC Validation'!$J$13,0)","v":0},0,0,0,{"$error":"#DIV/0!"},{"$error":"#DIV/0!"},null,{"$error":"#DIV/0!"}]
[{"$f":"'Advanced RTU Controls'!A17","v":0},{"$f":"'Advanced RTU Controls'!B17","v":0},{"$f":"'Advanced RTU Controls'!C17","v":0},{"$f":"'Advanced RTU Controls'!D17","v":0},{"$f":"'Advanced RTU Controls'!E17","v":0},{"$f":"'Advanced RTU Controls'!F17","v":0},{"$f":"'Advanced RTU Controls'!G17","v":0},{"$f":"'Advanced RTU Controls'!H17","v":0},{"$f":"'Advanced RTU Controls'!I17","v":0},{"$f":"_xlfn.XLOOKUP(D19,ControlMethod,'ARC Validation'!$M$2:$M$4)","v":{"$error":"#N/A"}},{"$f":"IFERROR(_xlfn.XLOOKUP($K$7,Validation!$B$116:$B$515,Validation!$D$116:$D$515),0)","v":0},{"$f":"_xlfn.XLOOKUP(E19,HtgType,'ARC Validation'!$P$2:$P$4)","v":{"$error":"#N/A"}},{"$f":"IF(OR(E19=0,E19=\"Other\"),0,IF(K19=\"Charleston\",INDEX('ARC Validation'!$B$20:$D$32,MATCH(A19,ARCBusType,0),MATCH(J19,'ARC Validation'!$B$2:$D$2,0)),IF(K19=\"Columbia\",INDEX('ARC Validation'!$E$20:$G$32,MATCH(A19,ARCBusType,0),MATCH(J19,'ARC Validation'!$B$2:$D$2,0)))))","v":0},{"$f":"IF(OR(E19=0,E19=\"Other\"),0,IF(K19=\"Charleston\",INDEX('ARC Validation'!$B$3:$D$15,MATCH(A19,ARCBusType,0),MATCH(J19,'ARC Validation'!$B$2:$D$2,0)),IF(K19=\"Columbia\",INDEX('ARC Validation'!$E$3:$G$15,MATCH(A19,ARCBusType,0),MATCH(J19,'ARC Validation'!$B$2:$D$2,0)))))","v":0},{"$error":"#N/A"},{"$f":"IF(K19=\"Charleston\",INDEX('ARC Validation'!$B$37:$D$49,MATCH(A19,ARCBusType,0),MATCH(J19,'ARC Validation'!$B$2:$D$2,0)),IF(K19=\"Columbia\",INDEX('ARC Validation'!$E$37:$G$49,MATCH(A19,ARCBusType,0),MATCH(J19,'ARC Validation'!$B$2:$D$2,0))))","v":false},{"$f":"_xlfn.XLOOKUP(J19,'ARC Validation'!$J$8:$J$10,'ARC Validation'!$I$8:$I$10)","v":{"$error":"#N/A"}},"No","No",1,{"$f":"IF(SUM(A19:I19)=0,\"\",_xlfn.XLOOKUP(T19,'ARC Validation'!$A$53:$A$55,'ARC Validation'!$B$53:$B$55))","v":""},{"$f":"IF(U19=\"Yes\",'ARC Validation'!$J$13,0)","v":0},0,0,0,{"$error":"#DIV/0!"},{"$error":"#DIV/0!"},null,{"$error":"#DIV/0!"}]
[{"$f":"'Advanced RTU Controls'!A18","v":0},{"$f":"'Advanced RTU Controls'!B18","v":0},{"$f":"'Advanced RTU Controls'!C18","v":0},{"$f":"'Advanced RTU Controls'!D18","v":0},{"$f":"'Advanced RTU Controls'!E18","v":0},{"$f":"'Advanced RTU Controls'!F18","v":0},{"$f":"'Advanced RTU Controls'!G18","v":0},{"$f":"'Advanced RTU Controls'!H18","v":0},{"$f":"'Advanced RTU Controls'!I18","v":0},{"$f":"_xlfn.XLOOKUP(D20,ControlMethod,'ARC Validation'!$M$2:$M$4)","v":{"$error":"#N/A"}},{"$f":"IFERROR(_xlfn.XLOOKUP($K$7,Validation!$B$116:$B$515,Validation!$D$116:$D$515),0)","v":0},{"$f":"_xlfn.XLOOKUP(E20,HtgType,'ARC Validation'!$P$2:$P$4)","v":{"$error":"#N/A"}},{"$f":"IF(OR(E20=0,E20=\"Other\"),0,IF(K20=\"Charleston\",INDEX('ARC Validation'!$B$20:$D$32,MATCH(A20,ARCBusType,0),MATCH(J20,'ARC Validation'!$B$2:$D$2,0)),IF(K20=\"Columbia\",INDEX('ARC Validation'!$E$20:$G$32,MATCH(A20,ARCBusType,0),MATCH(J20,'ARC Validation'!$B$2:$D$2,0)))))","v":0},{"$f":"IF(OR(E20=0,E20=\"Other\"),0,IF(K20=\"Charleston\",INDEX('ARC Validation'!$B$3:$D$15,MATCH(A20,ARCBusType,0),MATCH(J20,'ARC Validation'!$B$2:$D$2,0)),IF(K20=\"Columbia\",INDEX('ARC Validation'!$E$3:$G$15,MATCH(A20,ARCBusType,0),MATCH(J20,'ARC Validation'!$B$2:$D$2,0)))))","v":0},{"$error":"#N/A"},{"$f":"IF(K20=\"Charleston\",INDEX('ARC Validation'!$B$37:$D$49,MATCH(A20,ARCBusType,0),MATCH(J20,'ARC Validation'!$B$2:$D$2,0)),IF(K20=\"Columbia\",INDEX('ARC Validation'!$E$37:$G$49,MATCH(A20,ARCBusType,0),MATCH(J20,'ARC Validation'!$B$2:$D$2,0))))","v":false},{"$f":"_xlfn.XLOOKUP(J20,'ARC Validation'!$J$8:$J$10,'ARC Validation'!$I$8:$I$10)","v":{"$error":"#N/A"}},"No","No",1,{"$f":"IF(SUM(A20:I20)=0,\"\",_xlfn.XLOOKUP(T20,'ARC Validation'!$A$53:$A$55,'ARC Validation'!$B$53:$B$55))","v":""},{"$f":"IF(U20=\"Yes\",'ARC Validation'!$J$13,0)","v":0},0,0,0,{"$error":"#DIV/0!"},{"$error":"#DIV/0!"},null,{"$error":"#DIV/0!"}]
[{"$f":"'Advanced RTU Controls'!A19","v":0},{"$f":"'Advanced RTU Controls'!B19","v":0},{"$f":"'Advanced RTU Controls'!C19","v":0},{"$f":"'Advanced RTU Controls'!D19","v":0},{"$f":"'Advanced RTU Controls'!E19","v":0},{"$f":"'Advanced RTU Controls'!F19","v":0},{"$f":"'Advanced RTU Controls'!G19","v":0},{"$f":"'Advanced RTU Controls'!H19","v":0},{"$f":"'Advanced RTU Controls'!I19","v":0},{"$f":"_xlfn.XLOOKUP(D21,ControlMethod,'ARC Validation'!$M$2:$M$4)","v":{"$error":"#N/A"}},{"$f":"IFERROR(_xlfn.XLOOKUP($K$7,Validation!$B$116:$B$515,Validation!$D$116:$D$515),0)","v":0},{"$f":"_xlfn.XLOOKUP(E21,HtgType,'ARC Validation'!$P$2:$P$4)","v":{"$error":"#N/A"}},{"$f":"IF(OR(E21=0,E21=\"Other\"),0,IF(K21=\"Charleston\",INDEX('ARC Validation'!$B$20:$D$32,MATCH(A21,ARCBusType,0),MATCH(J21,'ARC Validation'!$B$2:$D$2,0)),IF(K21=\"Columbia\",INDEX('ARC Validation'!$E$20:$G$32,MATCH(A21,ARCBusType,0),MATCH(J21,'ARC Validation'!$B$2:$D$2,0)))))","v":0},{"$f":"IF(OR(E21=0,E21=\"Other\"),0,IF(K21=\"Charleston\",INDEX('ARC Validation'!$B$3:$D$15,MATCH(A21,ARCBusType,0),MATCH(J21,'ARC Validation'!$B$2:$D$2,0)),IF(K21=\"Columbia\",INDEX('ARC Validation'!$E$3:$G$15,MATCH(A21,ARCBusType,0),MATCH(J21,'ARC Validation'!$B$2:$D$2,0)))))","v":0},{"$error":"#N/A"},{"$f":"IF(K21=\"Charleston\",INDEX('ARC Validation'!$B$37:$D$49,MATCH(A21,ARCBusType,0),MATCH(J21,'ARC Validation'!$B$2:$D$2,0)),IF(K21=\"Columbia\",INDEX('ARC Validation'!$E$37:$G$49,MATCH(A21,ARCBusType,0),MATCH(J21,'ARC Validation'!$B$2:$D$2,0))))","v":false},{"$f":"_xlfn.XLOOKUP(J21,'ARC Validation'!$J$8:$J$10,'ARC Validation'!$I$8:$I$10)","v":{"$error":"#N/A"}},"No","No",1,{"$f":"IF(SUM(A21:I21)=0,\"\",_xlfn.XLOOKUP(T21,'ARC Validation'!$A$53:$A$55,'ARC Validation'!$B$53:$B$55))","v":""},{"$f":"IF(U21=\"Yes\",'ARC Validation'!$J$13,0)","v":0},0,0,0,{"$error":"#DIV/0!"},{"$error":"#DIV/0!"},null,{"$error":"#DIV/0!"}]
[{"$f":"'Advanced RTU Controls'!A20","v":0},{"$f":"'Advanced RTU Controls'!B20","v":0},{"$f":"'Advanced RTU Controls'!C20","v":0},{"$f":"'Advanced RTU Controls'!D20","v":0},{"$f":"'Advanced RTU Controls'!E20","v":0},{"$f":"'Advanced RTU Controls'!F20","v":0},{"$f":"'Advanced RTU Controls'!G20","v":0},{"$f":"'Advanced RTU Controls'!H20","v":0},{"$f":"'Advanced RTU Controls'!I20","v":0},{"$f":"_xlfn.XLOOKUP(D22,ControlMethod,'ARC Validation'!$M$2:$M$4)","v":{"$error":"#N/A"}},{"$f":"IFERROR(_xlfn.XLOOKUP($K$7,Validation!$B$116:$B$515,Validation!$D$116:$D$515),0)","v":0},{"$f":"_xlfn.XLOOKUP(E22,HtgType,'ARC Validation'!$P$2:$P$4)","v":{"$error":"#N/A"}},{"$f":"IF(OR(E22=0,E22=\"Other\"),0,IF(K22=\"Charleston\",INDEX('ARC Validation'!$B$20:$D$32,MATCH(A22,ARCBusType,0),MATCH(J22,'ARC Validation'!$B$2:$D$2,0)),IF(K22=\"Columbia\",INDEX('ARC Validation'!$E$20:$G$32,MATCH(A22,ARCBusType,0),MATCH(J22,'ARC Validation'!$B$2:$D$2,0)))))","v":0},{"$f":"IF(OR(E22=0,E22=\"Other\"),0,IF(K22=\"Charleston\",INDEX('ARC Validation'!$B$3:$D$15,MATCH(A22,ARCBusType,0),MATCH(J22,'ARC Validation'!$B$2:$D$2,0)),IF(K22=\"Columbia\",INDEX('ARC Validation'!$E$3:$G$15,MATCH(A22,ARCBusType,0),MATCH(J22,'ARC Validation'!$B$2:$D$2,0)))))","v":0},{"$error":"#N/A"},{"$f":"IF(K22=\"Charleston\",INDEX('ARC Validation'!$B$37:$D$49,MATCH(A22,ARCBusType,0),MATCH(J22,'ARC Validation'!$B$2:$D$2,0)),IF(K22=\"Columbia\",INDEX('ARC Validation'!$E$37:$G$49,MATCH(A22,ARCBusType,0),MATCH(J22,'ARC Validation'!$B$2:$D$2,0))))","v":false},{"$f":"_xlfn.XLOOKUP(J22,'ARC Validation'!$J$8:$J$10,'ARC Validation'!$I$8:$I$10)","v":{"$error":"#N/A"}},"No","No",1,{"$f":"IF(SUM(A22:I22)=0,\"\",_xlfn.XLOOKUP(T22,'ARC Validation'!$A$53:$A$55,'ARC Validation'!$B$53:$B$55))","v":""},{"$f":"IF(U22=\"Yes\",'ARC Validation'!$J$13,0)","v":0},0,0,0,{"$error":"#DIV/0!"},{"$error":"#DIV/0!"},null,{"$error":"#DIV/0!"}]
[{"$f":"'Advanced RTU Controls'!A21","v":0},{"$f":"'Advanced RTU Controls'!B21","v":0},{"$f":"'Advanced RTU Controls'!C21","v":0},{"$f":"'Advanced RTU Controls'!D21","v":0},{"$f":"'Advanced RTU Controls'!E21","v":0},{"$f":"'Advanced RTU Controls'!F21","v":0},{"$f":"'Advanced RTU Controls'!G21","v":0},{"$f":"'Advanced RTU Controls'!H21","v":0},{"$f":"'Advanced RTU Controls'!I21","v":0},{"$f":"_xlfn.XLOOKUP(D23,ControlMethod,'ARC Validation'!$M$2:$M$4)","v":{"$error":"#N/A"}},{"$f":"IFERROR(_xlfn.XLOOKUP($K$7,Validation!$B$116:$B$515,Validation!$D$116:$D$515),0)","v":0},{"$f":"_xlfn.XLOOKUP(E23,HtgType,'ARC Validation'!$P$2:$P$4)","v":{"$error":"#N/A"}},{"$f":"IF(OR(E23=0,E23=\"Other\"),0,IF(K23=\"Charleston\",INDEX('ARC Validation'!$B$20:$D$32,MATCH(A23,ARCBusType,0),MATCH(J23,'ARC Validation'!$B$2:$D$2,0)),IF(K23=\"Columbia\",INDEX('ARC Validation'!$E$20:$G$32,MATCH(A23,ARCBusType,0),MATCH(J23,'ARC Validation'!$B$2:$D$2,0)))))","v":0},{"$f":"IF(OR(E23=0,E23=\"Other\"),0,IF(K23=\"Charleston\",INDEX('ARC Validation'!$B$3:$D$15,MATCH(A23,ARCBusType,0),MATCH(J23,'ARC Validation'!$B$2:$D$2,0)),IF(K23=\"Columbia\",INDEX('ARC Validation'!$E$3:$G$15,MATCH(A23,ARCBusType,0),MATCH(J23,'ARC Validation'!$B$2:$D$2,0)))))","v":0},{"$error":"#N/A"},{"$f":"IF(K23=\"Charleston\",INDEX('ARC Validation'!$B$37:$D$49,MATCH(A23,ARCBusType,0),MATCH(J23,'ARC Validation'!$B$2:$D$2,0)),IF(K23=\"Columbia\",INDEX('ARC Validation'!$E$37:$G$49,MATCH(A23,ARCBusType,0),MATCH(J23,'ARC Validation'!$B$2:$D$2,0))))","v":false},{"$f":"_xlfn.XLOOKUP(J23,'ARC Validation'!$J$8:$J$10,'ARC Validation'!$I$8:$I$10)","v":{"$error":"#N/A"}},"No","No",1,{"$f":"IF(SUM(A23:I23)=0,\"\",_xlfn.XLOOKUP(T23,'ARC Validation'!$A$53:$A$55,'ARC Validation'!$B$53:$B$55))","v":""},{"$f":"IF(U23=\"Yes\",'ARC Validation'!$J$13,0)","v":0},0,0,0,{"$error":"#DIV/0!"},{"$error":"#DIV/0!"},null,{"$error":"#DIV/0!"}]
[{"$f":"'Advanced RTU Controls'!A22","v":0},{"$f":"'Advanced RTU Controls'!B22","v":0},{"$f":"'Advanced RTU Controls'!C22","v":0},{"$f":"'Advanced RTU Controls'!D22","v":0},{"$f":"'Advanced RTU Controls'!E22","v":0},{"$f":"'Advanced RTU Controls'!F22","v":0},{"$f":"'Advanced RTU Controls'!G22","v":0},{"$f":"'Advanced RTU Controls'!H22","v":0},{"$f":"'Advanced RTU Controls'!I22","v":0},{"$f":"_xlfn.XLOOKUP(D24,ControlMethod,'ARC Validation'!$M$2:$M$4)","v":{"$error":"#N/A"}},{"$f":"IFERROR(_xlfn.XLOOKUP($K$7,Validation!$B$116:$B$515,Validation!$D$116:$D$515),0)","v":0},{"$f":"_xlfn.XLOOKUP(E24,HtgType,'ARC Validation'!$P$2:$P$4)","v":{"$error":"#N/A"}},{"$f":"IF(OR(E24=0,E24=\"Other\"),0,IF(K24=\"Charleston\",INDEX('ARC Validation'!$B$20:$D$32,MATCH(A24,ARCBusType,0),MATCH(J24,'ARC Validation'!$B$2:$D$2,0)),IF(K24=\"Columbia\",INDEX('ARC Validation'!$E$20:$G$32,MATCH(A24,ARCBusType,0),MATCH(J24,'ARC Validation'!$B$2:$D$2,0)))))","v":0},{"$f":"IF(OR(E24=0,E24=\"Other\"),0,IF(K24=\"Charleston\",INDEX('ARC Validation'!$B$3:$D$15,MATCH(A24,ARCBusType,0),MATCH(J24,'ARC Validation'!$B$2:$D$2,0)),IF(K24=\"Columbia\",INDEX('ARC Validation'!$E$3:$G$15,MATCH(A24,ARCBusType,0),MATCH(J24,'ARC Validation'!$B$2:$D$2,0)))))","v":0},{"$error":"#N/A"},{"$f":"IF(K24=\"Charleston\",INDEX('ARC Validation'!$B$37:$D$49,MATCH(A24,ARCBusType,0),MATCH(J24,'ARC Validation'!$B$2:$D$2,0)),IF(K24=\"Columbia\",INDEX('ARC Validation'!$E$37:$G$49,MATCH(A24,ARCBusType,0),MATCH(J24,'ARC Validation'!$B$2:$D$2,0))))","v":false},{"$f":"_xlfn.XLOOKUP(J24,'ARC Validation'!$J$8:$J$10,'ARC Validation'!$I$8:$I$10)","v":{"$error":"#N/A"}},"No","No",1,{"$f":"IF(SUM(A24:I24)=0,\"\",_xlfn.XLOOKUP(T24,'ARC Validation'!$A$53:$A$55,'ARC Validation'!$B$53:$B$55))","v":""},{"$f":"IF(U24=\"Yes\",'ARC Validation'!$J$13,0)","v":0},0,0,0,{"$error":"#DIV/0!"},{"$error":"#DIV/0!"},null,{"$error":"#DIV/0!"}]
[{"$f":"'Advanced RTU Controls'!A23","v":0},{"$f":"'Advanced RTU Controls'!B23","v":0},{"$f":"'Advanced RTU Controls'!C23","v":0},{"$f":"'Advanced RTU Controls'!D23","v":0},{"$f":"'Advanced RTU Controls'!E23","v":0},{"$f":"'Advanced RTU Controls'!F23","v":0},{"$f":"'Advanced RTU Controls'!G23","v":0},{"$f":"'Advanced RTU Controls'!H23","v":0},{"$f":"'Advanced RTU Controls'!I23","v":0},{"$f":"_xlfn.XLOOKUP(D25,ControlMethod,'ARC Validation'!$M$2:$M$4)","v":{"$error":"#N/A"}},{"$f":"IFERROR(_xlfn.XLOOKUP($K$7,Validation!$B$116:$B$515,Validation!$D$116:$D$515),0)","v":0},{"$f":"_xlfn.XLOOKUP(E25,HtgType,'ARC Validation'!$P$2:$P$4)","v":{"$error":"#N/A"}},{"$f":"IF(OR(E25=0,E25=\"Other\"),0,IF(K25=\"Charleston\",INDEX('ARC Validation'!$B$20:$D$32,MATCH(A25,ARCBusType,0),MATCH(J25,'ARC Validation'!$B$2:$D$2,0)),IF(K25=\"Columbia\",INDEX('ARC Validation'!$E$20:$G$32,MATCH(A25,ARCBusType,0),MATCH(J25,'ARC Validation'!$B$2:$D$2,0)))))","v":0},{"$f":"IF(OR(E25=0,E25=\"Other\"),0,IF(K25=\"Charleston\",INDEX('ARC Validation'!$B$3:$D$15,MATCH(A25,ARCBusType,0),MATCH(J25,'ARC Validation'!$B$2:$D$2,0)),IF(K25=\"Columbia\",INDEX('ARC Validation'!$E$3:$G$15,MATCH(A25,ARCBusType,0),MATCH(J25,'ARC Validation'!$B$2:$D$2,0)))))","v":0},{"$error":"#N/A"},{"$f":"IF(K25=\"Charleston\",INDEX('ARC Validation'!$B$37:$D$49,MATCH(A25,ARCBusType,0),MATCH(J25,'ARC Validation'!$B$2:$D$2,0)),IF(K25=\"Columbia\",INDEX('ARC Validation'!$E$37:$G$49,MATCH(A25,ARCBusType,0),MATCH(J25,'ARC Validation'!$B$2:$D$2,0))))","v":false},{"$f":"_xlfn.XLOOKUP(J25,'ARC Validation'!$J$8:$J$10,'ARC Validation'!$I$8:$I$10)","v":{"$error":"#N/A"}},"No","No",1,{"$f":"IF(SUM(A25:I25)=0,\"\",_xlfn.XLOOKUP(T25,'ARC Validation'!$A$53:$A$55,'ARC Validation'!$B$53:$B$55))","v":""},{"$f":"IF(U25=\"Yes\",'ARC Validation'!$J$13,0)","v":0},0,0,0,{"$error":"#DIV/0!"},{"$error":"#DIV/0!"},null,{"$error":"#DIV/0!"}]
[{"$f":"'Advanced RTU Controls'!A24","v":0},{"$f":"'Advanced RTU Controls'!B24","v":0},{"$f":"'Advanced RTU Controls'!C24","v":0},{"$f":"'Advanced RTU Controls'!D24","v":0},{"$f":"'Advanced RTU Controls'!E24","v":0},{"$f":"'Advanced RTU Controls'!F24","v":0},{"$f":"'Advanced RTU Controls'!G24","v":0},{"$f":"'Advanced RTU Controls'!H24","v":0},{"$f":"'Advanced RTU Controls'!I24","v":0},{"$f":"_xlfn.XLOOKUP(D26,ControlMethod,'ARC Validation'!$M$2:$M$4)","v":{"$error":"#N/A"}},{"$f":"IFERROR(_xlfn.XLOOKUP($K$7,Validation!$B$116:$B$515,Validation!$D$116:$D$515),0)","v":0},{"$f":"_xlfn.XLOOKUP(E26,HtgType,'ARC Validation'!$P$2:$P$4)","v":{"$error":"#N/A"}},{"$f":"IF(OR(E26=0,E26=\"Other\"),0,IF(K26=\"Charleston\",INDEX('ARC Validation'!$B$20:$D$32,MATCH(A26,ARCBusType,0),MATCH(J26,'ARC Validation'!$B$2:$D$2,0)),IF(K26=\"Columbia\",INDEX('ARC Validation'!$E$20:$G$32,MATCH(A26,ARCBusType,0),MATCH(J26,'ARC Validation'!$B$2:$D$2,0)))))","v":0},{"$f":"IF(OR(E26=0,E26=\"Other\"),0,IF(K26=\"Charleston\",INDEX('ARC Validation'!$B$3:$D$15,MATCH(A26,ARCBusType,0),MATCH(J26,'ARC Validation'!$B$2:$D$2,0)),IF(K26=\"Columbia\",INDEX('ARC Validation'!$E$3:$G$15,MATCH(A26,ARCBusType,0),MATCH(J26,'ARC Validation'!$B$2:$D$2,0)))))","v":0},{"$error":"#N/A"},{"$f":"IF(K26=\"Charleston\",INDEX('ARC Validation'!$B$37:$D$49,MATCH(A26,ARCBusType,0),MATCH(J26,'ARC Validation'!$B$2:$D$2,0)),IF(K26=\"Columbia\",INDEX('ARC Validation'!$E$37:$G$49,MATCH(A26,ARCBusType,0),MATCH(J26,'ARC Validation'!$B$2:$D$2,0))))","v":false},{"$f":"_xlfn.XLOOKUP(J26,'ARC Validation'!$J$8:$J$10,'ARC Validation'!$I$8:$I$10)","v":{"$error":"#N/A"}},"No","No",1,{"$f":"IF(SUM(A26:I26)=0,\"\",_xlfn.XLOOKUP(T26,'ARC Validation'!$A$53:$A$55,'ARC Validation'!$B$53:$B$55))","v":""},{"$f":"IF(U26=\"Yes\",'ARC Validation'!$J$13,0)","v":0},0,0,0,{"$error":"#DIV/0!"},{"$error":"#DIV/0!"},null,{"$error":"#DIV/0!"}]
[{"$f":"'Advanced RTU Controls'!A25","v":0},{"$f":"'Advanced RTU Controls'!B25","v":0},{"$f":"'Advanced RTU Controls'!C25","v":0},{"$f":"'Advanced RTU Controls'!D25","v":0},{"$f":"'Advanced RTU Controls'!E25","v":0},{"$f":"'Advanced RTU Controls'!F25","v":0},{"$f":"'Advanced RTU Controls'!G25","v":0},{"$f":"'Advanced RTU Controls'!H25","v":0},{"$f":"'Advanced RTU Controls'!I25","v":0},{"$f":"_xlfn.XLOOKUP(D27,ControlMethod,'ARC Validation'!$M$2:$M$4)","v":{"$error":"#N/A"}},{"$f":"IFERROR(_xlfn.XLOOKUP($K$7,Validation!$B$116:$B$515,Validation!$D$116:$D$515),0)","v":0},{"$f":"_xlfn.XLOOKUP(E27,HtgType,'ARC Validation'!$P$2:$P$4)","v":{"$error":"#N/A"}},{"$f":"IF(OR(E27=0,E27=\"Other\"),0,IF(K27=\"Charleston\",INDEX('ARC Validation'!$B$20:$D$32,MATCH(A27,ARCBusType,0),MATCH(J27,'ARC Validation'!$B$2:$D$2,0)),IF(K27=\"Columbia\",INDEX('ARC Validation'!$E$20:$G$32,MATCH(A27,ARCBusType,0),MATCH(J27,'ARC Validation'!$B$2:$D$2,0)))))","v":0},{"$f":"IF(OR(E27=0,E27=\"Other\"),0,IF(K27=\"Charleston\",INDEX('ARC Validation'!$B$3:$D$15,MATCH(A27,ARCBusType,0),MATCH(J27,'ARC Validation'!$B$2:$D$2,0)),IF(K27=\"Columbia\",INDEX('ARC Validation'!$E$3:$G$15,MATCH(A27,ARCBusType,0),MATCH(J27,'ARC Validation'!$B$2:$D$2,0)))))","v":0},{"$error":"#N/A"},{"$f":"IF(K27=\"Charleston\",INDEX('ARC Validation'!$B$37:$D$49,MATCH(A27,ARCBusType,0),MATCH(J27,'ARC Validation'!$B$2:$D$2,0)),IF(K27=\"Columbia\",INDEX('ARC Validation'!$E$37:$G$49,MATCH(A27,ARCBusType,0),MATCH(J27,'ARC Validation'!$B$2:$D$2,0))))","v":false},{"$f":"_xlfn.XLOOKUP(J27,'ARC Validation'!$J$8:$J$10,'ARC Validation'!$I$8:$I$10)","v":{"$error":"#N/A"}},"No","No",1,{"$f":"IF(SUM(A27:I27)=0,\"\",_xlfn.XLOOKUP(T27,'ARC Validation'!$A$53:$A$55,'ARC Validation'!$B$53:$B$55))","v":""},{"$f":"IF(U27=\"Yes\",'ARC Validation'!$J$13,0)","v":0},0,0,0,{"$error":"#DIV/0!"},{"$error":"#DIV/0!"},null,{"$error":"#DIV/0!"}]
[{"$f":"'Advanced RTU Controls'!A26","v":0},{"$f":"'Advanced RTU Controls'!B26","v":0},{"$f":"'Advanced RTU Controls'!C26","v":0},{"$f":"'Advanced RTU Controls'!D26","v":0},{"$f":"'Advanced RTU Controls'!E26","v":0},{"$f":"'Advanced RTU Controls'!F26","v":0},{"$f":"'Advanced RTU Controls'!G26","v":0},{"$f":"'Advanced RTU Controls'!H26","v":0},{"$f":"'Advanced RTU Controls'!I26","v":0},{"$f":"_xlfn.XLOOKUP(D28,ControlMethod,'ARC Validation'!$M$2:$M$4)","v":{"$error":"#N/A"}},{"$f":"IFERROR(_xlfn.XLOOKUP($K$7,Validation!$B$116:$B$515,Validation!$D$116:$D$515),0)","v":0},{"$f":"_xlfn.XLOOKUP(E28,HtgType,'ARC Validation'!$P$2:$P$4)","v":{"$error":"#N/A"}},{"$f":"IF(OR(E28=0,E28=\"Other\"),0,IF(K28=\"Charleston\",INDEX('ARC Validation'!$B$20:$D$32,MATCH(A28,ARCBusType,0),MATCH(J28,'ARC Validation'!$B$2:$D$2,0)),IF(K28=\"Columbia\",INDEX('ARC Validation'!$E$20:$G$32,MATCH(A28,ARCBusType,0),MATCH(J28,'ARC Validation'!$B$2:$D$2,0)))))","v":0},{"$f":"IF(OR(E28=0,E28=\"Other\"),0,IF(K28=\"Charleston\",INDEX('ARC Validation'!$B$3:$D$15,MATCH(A28,ARCBusType,0),MATCH(J28,'ARC Validation'!$B$2:$D$2,0)),IF(K28=\"Columbia\",INDEX('ARC Validation'!$E$3:$G$15,MATCH(A28,ARCBusType,0),MATCH(J28,'ARC Validation'!$B$2:$D$2,0)))))","v":0},{"$error":"#N/A"},{"$f":"IF(K28=\"Charleston\",INDEX('ARC Validation'!$B$37:$D$49,MATCH(A28,ARCBusType,0),MATCH(J28,'ARC Validation'!$B$2:$D$2,0)),IF(K28=\"Columbia\",INDEX('ARC Validation'!$E$37:$G$49,MATCH(A28,ARCBusType,0),MATCH(J28,'ARC Validation'!$B$2:$D$2,0))))","v":false},{"$f":"_xlfn.XLOOKUP(J28,'ARC Validation'!$J$8:$J$10,'ARC Validation'!$I$8:$I$10)","v":{"$error":"#N/A"}},"No","No",1,{"$f":"IF(SUM(A28:I28)=0,\"\",_xlfn.XLOOKUP(T28,'ARC Validation'!$A$53:$A$55,'ARC Validation'!$B$53:$B$55))","v":""},{"$f":"IF(U28=\"Yes\",'ARC Validation'!$J$13,0)","v":0},0,0,0,{"$error":"#DIV/0!"},{"$error":"#DIV/0!"},null,{"$error":"#DIV/0!"}]

{"sheet":"ARC Validation","index":23,"n_rows":55,"n_cols":18,"rows_kept":55,"cut":false,"hidden":true,"merged":[[0,1,0,3],[0,4,0,6],[17,1,17,3],[17,4,17,6],[34,1,34,3],[34,4,34,6]]}
["Electric HP Heating kWh/ton1","Charleston, SC",null,null,"Columbia, SC",null,null,null,"From ICF analysis on 2/25/2025",null,null,"Control Methods",null,null,"Htg Type","Htg Type",null,"Building Type"]
["Building Type",1,2,3,1,2,3,null,"DCV Only:",null,null,"DCV Only",1,null,"Electric Resistance Heat",1,null,"Assembly"]
["Assembly",547.85558947119159,664.0421064611935,634.3756338808513,587.9791234693846,692.22900413806485,666.25746921243353,null,"CFw = 0.000700 kW/kWh",null,null,"DCV and VFD w/2-speed fan control",2,null,"Heat Pump",2,null,"Assisted Living"]
["Assisted Living",24.390018038903968,52.081328293044663,22.04346218971309,35.357422354293291,52.143996873751618,21.556331531663478,null,"DCV and Fan Speed Control:",null,null,"DCV and VFD w/multi-speed fan control",3,null,"Other",3,null,"Convenience Store"]
["College",-128.97176739305621,-104.50266961225992,-106.89220287342135,-2.7527858058477932,12.807821858847433,7.5766483039050172,null,"CFw = 0.000194 kW/kWh",null,null,null,null,null,null,null,null,"Garage"]
["Conditioned  Storage",80.692014979267469,-53.98800702526249,-62.213749380226787,108.23183918056321,-26.425009768968295,-36.936953876620663,null,null,null,null,null,null,null,null,null,null,"Grocery"]
["Convenience Store",135.6031634255886,82.864292220527943,64.365052170441686,190.90802953677803,129.07663174265454,109.99472067432654,null,"Winter CF values:","Control Scenario",null,null,null,null,null,null,null,"Religious Building"]
["Garage",34.56066150842473,22.66066150842471,22.669136619182755,37.129046996207272,25.229046996207259,24.054479431260248,null,6.9989943463653512E-4,1,null,null,null,null,null,null,null,"Restaurant"]
["Grocery",133.27550405034657,125.91420361095987,121.45404062885592,227.68498764319753,213.64780146269231,207.16199674420551,null,1.9402726032965881E-4,2,null,null,null,null,null,null,null,"Retail - Department Store"]
["Manufacturing Facility",-4.3826238152603594,-0.53761032128269193,6.924123125205103,3.4490721244143501,5.0822318901816033,10.52131966549301,null,{"$f":"I9","v":1.9402726032965881E-4},3,null,null,null,null,null,null,null,"Retail - Strip Mall"]
["Office - Low Rise",-11.399334513214029,-70.645455450129987,-55.532562731087893,31.550027853265732,-44.343958537814501,-34.495966254337134]
["Religious Building",30.076098194749484,20.51276472657996,15.43681663236692,39.31472001782759,33.700668241209151,32.231858222373972]
["Restaurant",64.898051193509673,56.802782765483997,38.699206311084211,98.772056017299008,80.958090595502512,61.114090112555573,null,"Incentive",350]
["Retail - Department Store",67.324439143425622,39.336887851785001,23.720096679856773,96.057086942770809,56.121987906702103,40.325930212829803]
["Retail - Strip Mall",69.280675008770018,61.897478140791591,63.136816632366887,95.322983892884636,81.260905218581215,79.931858222373961]
["1- Per IL TRM values were calculated using an assumed 2.3 COP for the heat pump which aligns with the 7.7 HSPF value in the HP/AC tune-up measure in the CEAM. ER values below calculated based on this same assumption."]
[]
["Electric ER Heating kWh/ton2","Charleston, SC",null,null,"Columbia, SC"]
["Building Type",1,2,3,1,2,3,null,null,"System Type","COP","HSPF - Assumed from AC/HP Tune-up Measure","COP"]
["Assembly",{"$f":"B3*$K$20/$K$21","v":1260.0678557837405},1527.2968448607448,1459.0639579259578,1352.3519839795845,1592.126709517549,1532.3921791885971,null,null,"HP",2.2999999999999998,7.7,{"$f":"L20/3.412","v":2.2567409144196953}]
["Assisted Living",56.097041489479118,119.78705507400272,50.699963036340101,81.322071414874557,119.93119280962871,49.579562522825995,null,null,"ER",1]
["College",-296.63506500402929,-240.35614010819779,-245.85206660886911,-6.331407353449924,29.457990275349093,17.426291098981537]
["Conditioned  Storage",185.59163445231516,-124.17241615810372,-143.09162357452161,248.93323011529537,-60.777522468627076,-84.954993916227522]
["Convenience Store",311.88727587885376,190.58787210721425,148.03961999201587,439.08846793458946,296.87625300810544,252.98785755095102]
["Garage",79.489521469376868,52.119521469376828,52.139014224120331,85.396808091276725,58.026808091276692,55.325302691898564]
["Grocery",306.53365931579708,289.60266830520771,279.34429344636862,523.67547157935428,491.38994336419228,476.47259251167264]
["Manufacturing Facility",-10.080034775098826,-1.2365037389501914,15.925483187971736,7.9328658861530048,11.689133347417686,24.199035230633921]
["Office - Low Rise",-26.218469380392264,-162.48454753529896,-127.72489428150215,72.565064062511183,-101.99110463697335,-79.340722384975408]
["Religious Building",69.175025847923806,47.1793588711339,35.504678254443917,90.423856041003447,77.511536954781036,74.133273911460137]
["Restaurant",149.26551774507223,130.64640036061317,89.008174515493678,227.17572883978769,186.20360836965577,140.56240725887781]
["Retail - Department Store",154.8462100298789,90.474842059105498,54.556222363670578,220.93129996837285,129.08057218541484,92.749639489508539]
["Retail - Strip Mall",159.34555252017103,142.36419972382066,145.21467825444384,219.24286295363464,186.90008200273678,183.8432739114601]
["2- ER heating calculated using the 2.3 COP assumption for the HP scenario"]
[]
["Electric Cooling kWh/ton","Charleston, SC",null,null,"Columbia, SC"]
["Building Type",1,2,3,1,2,3]
["Assembly",178.1871729123888,303.81403629989967,296.70418808997135,161.74786416270683,283.80551381417786,280.50386480478937]
["Assisted Living",32.070825245187329,622.32243091237615,619.00529603232326,28.993903981111885,616.3274715289009,617.05820533880751]
["College",333.62424737475681,705.44748385726507,693.93338014606024,296.73389292949867,666.78527416298186,661.33476893446436]
["Conditioned  Storage",23.14677482481283,353.19391744184145,340.43148679972137,20.455295121453062,352.37440726751254,348.08744886968014]
["Convenience Store",190.36955898006519,1138.9259457337771,1115.2282682786779,171.84051572862708,1110.1446903456713,1097.5103671689544]
["Garage",108.14519726134493,748.22209445042313,753.97819560947846,96.078901683585869,712.95395615742132,730.37862834243947]
["Grocery",170.04233114981173,634.67512417281637,624.20053510589514,153.39390272202422,614.70141029966044,608.63682162130794]
["Manufacturing Facility",76.904081727018792,834.17566692584842,814.66232142974684,67.897262775292774,825.32919322583211,814.76371693756607]
["Office - Low Rise",57.982722823872038,1060.4945935346025,1035.4937143820152,52.490179894610151,1061.4590370605076,1049.0643914823702]
["Religious Building",31.905861495649638,1284.7593082333087,1286.3273790806063,28.562597344806278,1231.5778576010171,1251.4813597447012]
["Restaurant",54.0666684360286,668.74692377824897,671.27279626098118,48.923314048206421,654.71502421726927,662.20098874031555]
["Retail - Department Store",120.17976534581734,782.75938822297144,761.76865784622066,108.98569314301346,771.31414455030256,760.29805431223065]
["Retail - Strip Mall",109.98249574349595,798.26162254159249,776.25122748727676,99.808815851950129,790.23149905591924,776.30668484101363]
[]
[]
["Error Number","Error Message","Qualifies"]
[0,"Yes","Yes"]
[1,"Error message 1 - See below","No. Please fill in all blue cells."]
[2,"Error message 2 - See below","No. Please fill in zip code on Project Information tab"]

{"sheet":"Inventory Instructions","index":24,"n_rows":31,"n_cols":7,"rows_kept":31,"cut":false,"hidden":true,"merged":[[17,2,17,6],[1,1,1,7],[2,1,2,7],[3,1,3,7],[4,1,4,7],[5,1,5,7],[11,2,11,6]]}
[]
[]
[]
[null,"C&I Prescriptive Program"]
[null,"Unitary HVAC"]
[]
[null,null,null,"Copyright © 2010 ICF Resources, LLC, All Rights Reserved. Do not copy, distribute or quote without ICF’s written permission."]
[]
[]
[null,null,"Instructions"]
[null,null,"1.  Read \"Eligibility Requirements\" for detailed information on participation for this program"]
[null,null,"2. This worksheet is required for all VFD Instllation projects.The completed application must be completed and submitted electronically to the email address below or may be submitted in writing either by mail or fax."]
[null,null,null,"Mailing Address:",null,"Fax Number:","Email Address:"]
[null,null,null,"SCE&G - EnergyWise for Your Business",null,"877-646-7234","EnergyExperts@sceg.com"]
[null,null,null,"Mail Code: DSM"]
[null,null,null,"220 Operation Way"]
[null,null,null,"Cayce, SC 29033"]
[null,null,"3. Enter the required project information in the shaded areas only. A description of this information is provided below in the Inputs section.                                    "]
[null,null,null,"- All other information will be populated automatically."]
[null,null,"4. Save file with a project name and date using the naming convention: project name_YY_MM_DD.xls"]
[null,null,"5. Email the renamed Excel spreadsheet and the completed project application form to EnergyExperts@sceg.com"]
[]
[null,null,"Inputs"]
[null,null,"Building Method Fields",null,"Unit","Input Range","Description"]
[null,null,"1.","Building Type","n/a","Select from Building Types","Enter the building type that most closely matches where the installation of the HVAC system is taking place"]
[null,null,"2.","Device Type","n/a","Select From HVAC Type","Types include Unitary A/C, Split System A/C, Heat Pump, Packaged Terminal HP, Packaged Terminal AC, Water Cooled"]
[null,null,"3.","Manufacturer","n/a","Any","Enter the manufacturer of the HVAC unit"]
[null,null,"4.","Model Number","n/a","Any","Enter the model number of the HVAC unit"]
[null,null,"5.","Size","Tons","Any","Enter the size in tons of the HVAC unit"]
[null,null,"6.","Cooling Efficiency","EER","Any","Enter the efficiency in tons of the HVAC unit"]
[null,null,"7.","Quantity","Whole Number","Any","Enter the quantity of HVAC units being installed"]

{"sheet":"Input Key","index":25,"n_rows":17,"n_cols":5,"rows_kept":17,"cut":false,"hidden":true,"merged":[]}
[]
[]
[null,"Building Type",null,"Device Type","Measure code"]
[null,"Office",null,"Split System A/C","S"]
[null,"Retail",null,"Unitary A/C","U"]
[null,"School",null,"Split System Heat Pump","SH"]
[null,"University",null,"Unitary Heat Pump","UH"]
[null,"Religious Facility",null,"Packaged Terminal A/C","PTAC"]
[null,"Grocery",null,"Packaged Terminal Heat Pump","PTHP"]
[null,"Lodging"]
[null,"Industrial"]
[null,"Warehouse"]
[null,"Health Facility"]
[null,"Multifamily"]
[null,"Fitness/Recreation "]
[null,"Restaurant"]
[null,"Other"]

{"sheet":"HVAC Unitary-old","index":26,"n_rows":51,"n_cols":25,"rows_kept":51,"cut":false,"hidden":true,"merged":[[6,9,7,9],[6,10,7,11],[6,5,6,8],[6,0,7,0],[6,1,7,2],[6,3,7,3],[6,4,7,4],[0,0,0,17],[1,0,1,17],[2,0,2,17],[3,0,3,17],[6,12,7,12],[4,1,4,2],[4,6,4,7],[4,10,4,11],[4,8,4,9],[4,3,4,5],[11,1,11,2],[11,10,11,11],[12,1,12,2],[12,10,12,11],[13,1,13,2],[13,10,13,11],[8,1,8,2],[8,10,8,11],[9,1,9,2],[9,10,9,11],[10,1,10,2],[10,10,10,11],[17,1,17,2],[17,10,17,11],[18,1,18,2],[18,10,18,11],[19,1,19,2],[19,10,19,11],[14,1,14,2],[14,10,14,11],[15,1,15,2],[15,10,15,11],[16,1,16,2],[16,10,16,11],[23,0,23,9],[25,0,25,11],[26,0,26,11],[27,0,27,2],[27,3,27,5],[20,1,20,2],[20,10,20,11],[21,1,21,2],[21,10,21,11],[22,1,22,2],[22,10,22,11],[42,6,42,7],[48,6,48,7],[44,9,44,10],[46,9,46,10],[34,3,34,5],[34,6,34,7],[33,9,33,10],[34,9,34,10],[28,0,28,11],[30,3,30,5],[31,0,31,2],[31,3,31,5],[30,9,30,10],[31,9,31,10],[29,0,30,2],[29,11,30,11],[32,0,32,2],[32,3,32,5],[32,6,32,7],[32,9,32,10],[33,0,33,2],[33,3,33,5],[34,0,34,2],[47,9,47,10],[49,0,49,11],[27,9,27,10],[27,6,27,7],[30,6,30,7],[31,6,31,7],[33,6,33,7],[45,0,45,11],[46,0,46,2],[46,3,48,5],[47,0,47,2],[48,0,48,2],[46,6,46,7],[47,6,47,7],[41,0,41,11],[42,0,42,2],[42,3,44,5],[43,0,43,2],[44,0,44,2],[42,9,42,10],[43,9,43,10],[35,0,35,11],[36,3,36,5],[36,6,36,7],[36,9,36,10],[48,9,48,10],[29,3,29,5],[29,6,29,7],[29,9,29,10],[29,8,30,8],[43,6,43,7],[44,6,44,7],[40,0,40,2],[40,3,40,5],[40,6,40,7],[40,9,40,10],[39,0,39,2],[39,3,39,5],[39,6,39,7],[39,9,39,10],[36,0,36,2],[37,0,37,2],[37,3,37,5],[37,6,37,7],[37,9,37,10],[38,0,38,2],[38,3,38,5],[38,6,38,7],[38,9,38,10]]}
["Fill in Blue Cells Only!"]
[" HVAC UNITARY TECHNICAL REQUIREMENTS"]
["§ Unitary and split system cooling equipment must meet Air-Conditioning and Refrigeration Institute (ARI) standards (210/240, 320, or 340/360), be certified by a Nationally Recognized Testing Laboratory (NRTL), and use a minimum ozone-depleting refrigerant (e.g., HCFC or HFC).\n§ Electric heat pumps, single packaged units, and split systems are eligible systems.\n§ Qualifying split systems must have both a new condenser and a new coil that meet ARI specifications, and matched system performance (condenser and coil) must meet or exceed the minimum SEER/EER/COP outlined in Table 2.\n§ Units being installed must meet both EER and IEER efficiency values to fulfill the requirements."]
["TABLE 1: HVAC EQUIPMENT INFORMATION"]
["S = Split A/C","U = Unitary A/C",null,"H = Split or Unitary Heat Pump",null,null,"P = PTAC",null,"T = PTHP",null,"W = Water and Evaporative"]
[]
["Equipment Type","Manufacturer",null,"Model #","Unit Size (Tons)","Unit Efficiency",null,null,null,"Quantity","Incentive $ / Ton",null,"Subtotal Incentive"]
[null,null,null,null,null,"SEER","EER","IEER","COP",null,null,null,null,null,null,null,null,null,null,null,null,"Tier 1","Tier 2"]
["S",12,null,12,5,null,18,18,null,1,{"$f":"IF(OR(AND(W9=\"Yes\", E9<63.3)),75,IF(OR(AND(W9=\"No\",V9=\"Yes\", E9<63.3)),50,IF(OR(AND(W9=\"Yes\", E9>=63.3)),20,IF(OR(AND(W9=\"No\", V9=\"Yes\", E9>=63.3)),15,IF(OR(AND(W9=\"N/A\",V9=\"Yes\",A9=\"W\")),60,IF(OR(AND(W9=\"N/A\",V9=\"Yes\",A9=\"P\",E9<0.75)),20,IF(OR(AND(W9=\"N/A\",V9=\"Yes\",A9=\"P\",E9>=0.75,E9<1)),25,IF(OR(AND(W9=\"N/A\",V9=\"Yes\",A9=\"P\",E9>=1)),35,IF(OR(AND(W9=\"N/A\",V9=\"Yes\",A9=\"T\",E9<0.75)),20,IF(OR(AND(W9=\"N/A\",V9=\"Yes\",A9=\"T\",E9>=0.75,E9<1)),25,IF(OR(AND(W9=\"N/A\",V9=\"Yes\",A9=\"T\",E9>=1)),30,0)))))))))))","v":0},null,{"$f":"IF(OR(AND(A9=\"P\")),J9*K9,IF(OR(AND(A9=\"T\")),J9*K9,E9*J9*K9))","v":0},null,null,null,null,null,null,null,"S",{"$f":"IF(OR(AND(A9=\"S\", E9<5.4, F9>=15, G9>=12),AND(A9=\"U\", E9<5.4, F9>=15, G9>=11.6),AND(A9=\"H\", E9<5.4, F9>=15, G9>=14.3),AND(A9=\"S\", E9>=5.4, E9<11.25, G9>=12, H9>=13.4),AND(A9=\"U\", E9>=5.4, E9<11.25, G9>=12, H9>=13.4),AND(A9=\"H\", E9>=5.4, E9<11.25, G9>=12, H9>=13.4),AND(A9=\"S\",E9>=11.25,E9<20,G9>=11.8,H9>=12.8),AND(A9=\"U\",E9>=11.25,E9<20,G9>=11.8,H9>=12.8),AND(A9=\"H\",E9>=11.25,E9<20,G9>=11.8,H9>=12.8),AND(A9=\"S\", E9>=20, E9<63.3, G9>=10.6, H9>=12.1),AND(A9=\"U\", E9>=20, E9<63.3, G9>=10.6, H9>=12.1),AND(A9=\"H\", E9>=20, E9<63.3, G9>=10.6, H9>=12.1),AND(A9=\"S\", E9>=63.3, G9>=10.3, H9>=12),AND(A9=\"U\", E9>=63.3, G9>=10.3, H9>=12),AND(A9=\"H\", E9>=63.3, G9>=10.3, H9>=12),AND(A9=\"W\", E9<5.4,G9>=14,H9>=13.4),AND(A9=\"W\",E9>=5.4,E9<11.25,G9>=12.8,H9>=13.1),AND(A9=\"W\",E9>=11.25,G9>=12,H9>=12.4),AND(A9=\"P\", E9<0.75, G9>=12),AND(A9=\"P\", E9>=0.75, E9<1, G9>=11.5),AND(A9=\"P\", E9>=1, G9>=10.5),AND(A9=\"T\", E9<0.75, G9>=12, I9>=3.3),AND(A9=\"T\", E9>=0.75, E9<1, G9>=11.5, I9>=3.2),AND(A9=\"T\", E9>=1, G9>=10.3, I9>=3.2)),\"Yes\",\"No\")","v":"No"},{"$f":"IF(OR(AND(A9=\"S\", E9<5.4, F9>=16, G9>=12.5),AND(A9=\"U\", E9<5.4, F9>=16, G9>=12),AND(A9=\"H\", E9<5.4, F9>=16, G9>=14.6),AND(A9=\"S\", E9>=5.4, E9<11.25, G9>=12, H9>=13.8),AND(A9=\"U\", E9>=5.4, E9<11.25, G9>=12, H9>=13.8),AND(A9=\"H\", E9>=5.4, E9<11.25, G9>=12, H9>=13.8),AND(A9=\"S\",E9>=11.25,E9<20,G9>=11.8,H9>=13.2),AND(A9=\"U\",E9>=11.25,E9<20,G9>=11.8,H9>=13.2),AND(A9=\"H\",E9>=11.25,E9<20,G9>=11.8,H9>=13.2),AND(A9=\"S\", E9>=20, E9<63.3, G9>=10.6, H9>=12.4),AND(A9=\"U\", E9>=20, E9<63.3, G9>=10.6, H9>=12.4),AND(A9=\"H\", E9>=20, E9<63.3, G9>=10.6, H9>=12.4),AND(A9=\"S\", E9>=63.3, G9>=10.3, H9>=12.3),AND(A9=\"U\", E9>=63.3, G9>=10.3, H9>=12.3),AND(A9=\"H\", E9>=63.3, G9>=10.3, H9>=12.3)),\"Yes\",IF(OR(AND(A9=\"W\"),AND(A9=\"P\"),AND(A9=\"T\")),\"N/A\",\"No\"))","v":"No"},null,{"$f":"IF(OR(A9=#REF!,'HVAC Unitary'!D23=#REF!),'HVAC Unitary'!T23*'HVAC Unitary'!M23,R23*'HVAC Unitary'!M23*'HVAC Unitary'!G23)","v":{"$error":"#REF!"}}]
["U",2,null,2,2,15,15,null,null,2,{"$f":"IF(OR(AND(W10=\"Yes\", E10<63.3)),75,IF(OR(AND(W10=\"No\",V10=\"Yes\", E10<63.3)),50,IF(OR(AND(W10=\"Yes\", E10>=63.3)),20,IF(OR(AND(W10=\"No\", V10=\"Yes\", E10>=63.3)),15,IF(OR(AND(W10=\"N/A\",V10=\"Yes\",A10=\"W\")),60,IF(OR(AND(W10=\"N/A\",V10=\"Yes\",A10=\"P\",E10<0.75)),20,IF(OR(AND(W10=\"N/A\",V10=\"Yes\",A10=\"P\",E10>=0.75,E10<1)),25,IF(OR(AND(W10=\"N/A\",V10=\"Yes\",A10=\"P\",E10>=1)),35,IF(OR(AND(W10=\"N/A\",V10=\"Yes\",A10=\"T\",E10<0.75)),20,IF(OR(AND(W10=\"N/A\",V10=\"Yes\",A10=\"T\",E10>=0.75,E10<1)),25,IF(OR(AND(W10=\"N/A\",V10=\"Yes\",A10=\"T\",E10>=1)),30,0)))))))))))","v":50},null,{"$f":"IF(OR(AND(A10=\"P\")),J10*K10,IF(OR(AND(A10=\"T\")),J10*K10,E10*J10*K10))","v":200},null,null,null,null,null,null,null,"U",{"$f":"IF(OR(AND(A10=\"S\", E10<5.4, F10>=15, G10>=12),AND(A10=\"U\", E10<5.4, F10>=15, G10>=11.6),AND(A10=\"H\", E10<5.4, F10>=15, G10>=14.3),AND(A10=\"S\", E10>=5.4, E10<11.25, G10>=12, H10>=13.4),AND(A10=\"U\", E10>=5.4, E10<11.25, G10>=12, H10>=13.4),AND(A10=\"H\", E10>=5.4, E10<11.25, G10>=12, H10>=13.4),AND(A10=\"S\",E10>=11.25,E10<20,G10>=11.8,H10>=12.8),AND(A10=\"U\",E10>=11.25,E10<20,G10>=11.8,H10>=12.8),AND(A10=\"H\",E10>=11.25,E10<20,G10>=11.8,H10>=12.8),AND(A10=\"S\", E10>=20, E10<63.3, G10>=10.6, H10>=12.1),AND(A10=\"U\", E10>=20, E10<63.3, G10>=10.6, H10>=12.1),AND(A10=\"H\", E10>=20, E10<63.3, G10>=10.6, H10>=12.1),AND(A10=\"S\", E10>=63.3, G10>=10.3, H10>=12),AND(A10=\"U\", E10>=63.3, G10>=10.3, H10>=12),AND(A10=\"H\", E10>=63.3, G10>=10.3, H10>=12),AND(A10=\"W\", E10<5.4,G10>=14,H10>=13.4),AND(A10=\"W\",E10>=5.4,E10<11.25,G10>=12.8,H10>=13.1),AND(A10=\"W\",E10>=11.25,G10>=12,H10>=12.4),AND(A10=\"P\", E10<0.75, G10>=12),AND(A10=\"P\", E10>=0.75, E10<1, G10>=11.5),AND(A10=\"P\", E10>=1, G10>=10.5),AND(A10=\"T\", E10<0.75, G10>=12, I10>=3.3),AND(A10=\"T\", E10>=0.75, E10<1, G10>=11.5, I10>=3.2),AND(A10=\"T\", E10>=1, G10>=10.3, I10>=3.2)),\"Yes\",\"No\")","v":"Yes"},{"$f":"IF(OR(AND(A10=\"S\", E10<5.4, F10>=16, G10>=12.5),AND(A10=\"U\", E10<5.4, F10>=16, G10>=12),AND(A10=\"H\", E10<5.4, F10>=16, G10>=14.6),AND(A10=\"S\", E10>=5.4, E10<11.25, G10>=12, H10>=13.8),AND(A10=\"U\", E10>=5.4, E10<11.25, G10>=12, H10>=13.8),AND(A10=\"H\", E10>=5.4, E10<11.25, G10>=12, H10>=13.8),AND(A10=\"S\",E10>=11.25,E10<20,G10>=11.8,H10>=13.2),AND(A10=\"U\",E10>=11.25,E10<20,G10>=11.8,H10>=13.2),AND(A10=\"H\",E10>=11.25,E10<20,G10>=11.8,H10>=13.2),AND(A10=\"S\", E10>=20, E10<63.3, G10>=10.6, H10>=12.4),AND(A10=\"U\", E10>=20, E10<63.3, G10>=10.6, H10>=12.4),AND(A10=\"H\", E10>=20, E10<63.3, G10>=10.6, H10>=12.4),AND(A10=\"S\", E10>=63.3, G10>=10.3, H10>=12.3),AND(A10=\"U\", E10>=63.3, G10>=10.3, H10>=12.3),AND(A10=\"H\", E10>=63.3, G10>=10.3, H10>=12.3)),\"Yes\",IF(OR(AND(A10=\"W\"),AND(A10=\"P\"),AND(A10=\"T\")),\"N/A\",\"No\"))","v":"No"}]
["P",2,null,2,2,15,15,null,null,1,35,null,35,null,null,null,null,null,null,null,"H","Yes","N/A"]
["T",1,null,1,3,15,15,null,8,1,30,null,30,null,null,null,null,null,null,null,"P","Yes","N/A"]
["H",1,null,1,3,15,15,null,8,1,50,null,150,null,null,null,null,null,null,null,"T","Yes","No"]
[null,null,null,null,null,null,null,null,null,null,0,null,0,null,null,null,null,null,null,null,null,"No","No"]
[null,null,null,null,null,null,null,null,null,null,0,null,0,null,null,null,null,null,null,null,null,"No","No"]
[null,null,null,null,null,null,null,null,null,null,0,null,0,null,null,null,null,null,null,null,null,"No","No"]
[null,null,null,null,null,null,null,null,null,null,0,null,0,null,null,null,null,null,null,null,null,"No","No"]
[null,null,null,null,null,null,null,null,null,null,0,null,0,null,null,null,null,null,null,null,null,"No","No"]
[null,null,null,null,null,null,null,null,null,null,0,null,0,null,null,null,null,null,null,null,null,"No","No"]
[null,null,null,null,null,null,null,null,null,null,0,null,0,null,null,null,null,null,null,null,null,"No","No"]
[null,null,null,null,null,null,null,null,null,null,0,null,0,null,null,null,null,null,null,null,null,"No","No"]
[null,null,null,null,null,null,null,null,null,null,0,null,0,null,null,null,null,null,null,null,null,"No","No"]
[null,null,null,null,null,null,null,null,null,null,0,null,0,null,null,null,null,null,null,null,null,"No","No"]
["Attach additional worksheets if needed",null,null,null,null,null,null,null,null,null,"Total Requested Incentive",null,{"$f":"SUM(M9:M23)","v":415}]
[]
[]
["TABLE 2: QUALIFYING EFFICIENCY AND INCENTIVES"]
["Size Category (tons)",null,null,"Sub-Category",null,null,"Tier 1 Minimum Requirement",null,"Tier 1 Incentive","Tier 2 Minimum Requirement",null,"Tier 2 Incentive"]
["Air Conditioners (Cooling Mode) - Unitary and Split Systems"]
["< 5.4",null,null,"Split System",null,null,"15.0 SEER and 12.0 EER",null,"$75/ton","16.0 SEER and 12.5 EER",null,"$100/ton"]
[null,null,null,"Single Package",null,null,"15.0 SEER and 11.6 EER",null,null,"16.0 SEER and 12.0 EER"]
["≥ 5.4 and < 11.25",null,null,"Split System and Single Package",null,null,"12.0 EER and 13.4 IEER",null,"$60/ton","12.0 EER and 13.8 IEER",null,"$75/ton"]
["≥ 11.25 and < 20",null,null,"Split System and Single Package",null,null,"11.8 EER and 12.8 IEER",null,"$50/ton","11.8 EER and 13.2 IEER",null,"$70/ton"]
["≥ 20 and < 63.3",null,null,"Split System and Single Package",null,null,"10.6 EER and 12.1 IEER",null,"$40/ton","10.6 EER and 12.4 IEER",null,"$60/ton"]
[" ≥ 63.3",null,null,"Split System and Single Package",null,null,"10.3 EER and 12.0 IEER",null,"$15/ton","10.3 EER and 12.3 IEER",null,"$20/ton"]
["Air Source Heat Pumps (Cooling Mode) - Unitary and Split Systems"]
["< 5.4",null,null,"Split System and Single Package",null,null,"15.0 SEER and 14.3 EER",null,"$100/ton","16.0 SEER and 14.6 EER",null,"$125/ton"]
["≥ 5.4 and < 11.25",null,null,"Split System and Single Package",null,null,"12.0 EER and 13.4 IEER",null,"$75/ton","12.0 EER and 13.8 IEER",null,"$100/ton"]
["≥ 11.25 and < 20",null,null,"Split System and Single Package",null,null,"11.8 EER and 12.8 IEER",null,"$55/ton","11.8 EER and 13.2 IEER",null,"$80/ton"]
["≥ 20 and < 63.3",null,null,"Split System and Single Package",null,null,"10.6 EER and 12.1 IEER",null,"$50/ton","10.6 EER and 12.4 IEER",null,"$75/ton"]
[" ≥ 63.3",null,null,"Split System and Single Package",null,null,"10.3 EER and 12.0 IEER",null,"$20/ton","10.3 EER and 12.3 IEER",null,"$25/ton"]
["Packaged Terminal Air Conditioner (PTAC)"]
["< 0.75",null,null,"Single Package",null,null,"12.0 EER",null,"$20/unit","N/A",null,"N/A"]
["≥ 0.75 and < 1.0",null,null,null,null,null,"11.5 EER",null,"$30/unit","N/A",null,"N/A"]
["≥ 1.0",null,null,null,null,null,"10.5 EER",null,"$40/unit","N/A",null,"N/A"]
["Packaged Terminal Heat Pump (PTHP)"]
["< 0.75",null,null,"Single Package",null,null,"12.0 EER and 3.3 COP",null,"$40/unit","N/A",null,"N/A"]
["≥ 0.75 and < 1.0",null,null,null,null,null,"11.5 EER and 3.2 COP",null,"$50/unit","N/A",null,"N/A"]
["≥ 1.0",null,null,null,null,null,"10.3 EER and 3.2 COP",null,"$60/unit","N/A",null,"N/A"]
["Note: Tons are based on 12,000 BTUH net output per ton."]
[null,null,null,null,null,null,null,null,null,null,null,null,{"$f":"\"Version \"  &  'Version Tracking'!C4","v":"Version 15.2"}]

{"sheet":"Measure Code Summary","index":27,"n_rows":30,"n_cols":11,"rows_kept":30,"cut":false,"hidden":true,"merged":[[1,1,1,9],[2,1,2,9],[3,1,3,9],[4,1,4,9],[17,9,18,9],[5,1,5,9],[10,3,10,4],[11,3,11,4],[29,8,29,9],[8,1,8,10],[12,3,12,4],[17,10,18,10],[17,8,18,8],[17,1,18,1],[16,1,16,10],[13,3,13,4],[17,2,18,2],[17,3,18,3],[17,4,18,4],[17,5,17,7]]}
[]
[]
[]
[null,"Measure Summary"]
[null,{"$f":"\"Version # \"&'Version Tracking'!C4","v":"Version # 15.2"}]
[null," "]
[null,"Copyright © 2015 ICF Resources, LLC, All Rights Reserved. Do not copy, distribute or quote without ICF’s written permission."]
[]
[null,"Required General Project Information"]
[]
[null,null,"Project Name",{"$f":"#REF!","v":{"$error":"#REF!"}},null,null,"Prepared By"]
[null,null,"Project Address",{"$f":"#REF!","v":{"$error":"#REF!"}},null,null,"Contact Person",{"$f":"#REF!","v":{"$error":"#REF!"}}]
[null,null,"City",{"$f":"#REF!","v":{"$error":"#REF!"}},null,null,"Phone",{"$f":"#REF!","v":{"$error":"#REF!"}}]
[null,null,"ZIP",{"$f":"#REF!","v":{"$error":"#REF!"}},null,null,"Email",{"$f":"#REF!","v":{"$error":"#REF!"}}]
[]
[]
[null,"Unitary HVAC Equipment Information"]
[null,"Equipment","Manufacturer","Model Number","Unit Size (Tons)","Unit Efficiency",null,null,"Incentive $/Ton","Quantity","Subtotal Incentive"]
[null,null,null,null,null,"SEER or IEER","EER","COP"]
[null,{"$f":"IF('HVAC Unitary'!D23=\"\",\"\",'HVAC Unitary'!D23)","v":""},{"$f":"IF('HVAC Unitary'!E23=\"\",\"\",'HVAC Unitary'!E23)","v":""},{"$f":"IF('HVAC Unitary'!F23=\"\",\"\",'HVAC Unitary'!F23)","v":""},{"$f":"IF('HVAC Unitary'!G23=\"\",\"\",'HVAC Unitary'!G23)","v":""},{"$f":"IF('HVAC Unitary'!K23=\"\",\"\",'HVAC Unitary'!K23)","v":""},{"$f":"IF('HVAC Unitary'!J23=\"\",\"\",'HVAC Unitary'!J23)","v":""},{"$f":"IF('HVAC Unitary'!L23=\"\",\"\",'HVAC Unitary'!L23)","v":""},{"$f":"IF(OR(K20=\"\",E20=\"\"),\"\",K20/E20/J20)","v":""},{"$f":"IF('HVAC Unitary'!M23=\"\",\"\",'HVAC Unitary'!M23)","v":""},{"$f":"IF('HVAC Unitary'!N23=\"\",\"\",'HVAC Unitary'!N23)","v":0}]
[null,{"$f":"IF('HVAC Unitary'!D24=\"\",\"\",'HVAC Unitary'!D24)","v":""},{"$f":"IF('HVAC Unitary'!E24=\"\",\"\",'HVAC Unitary'!E24)","v":""},{"$f":"IF('HVAC Unitary'!F24=\"\",\"\",'HVAC Unitary'!F24)","v":""},{"$f":"IF('HVAC Unitary'!G24=\"\",\"\",'HVAC Unitary'!G24)","v":""},{"$f":"IF('HVAC Unitary'!K24=\"\",\"\",'HVAC Unitary'!K24)","v":""},{"$f":"IF('HVAC Unitary'!J24=\"\",\"\",'HVAC Unitary'!J24)","v":""},{"$f":"IF('HVAC Unitary'!L24=\"\",\"\",'HVAC Unitary'!L24)","v":""},{"$f":"IF(OR(K21=\"\",E21=\"\"),\"\",K21/E21/J21)","v":""},{"$f":"IF('HVAC Unitary'!M24=\"\",\"\",'HVAC Unitary'!M24)","v":""},{"$f":"IF('HVAC Unitary'!N24=\"\",\"\",'HVAC Unitary'!N24)","v":0}]
[null,{"$f":"IF('HVAC Unitary'!D25=\"\",\"\",'HVAC Unitary'!D25)","v":""},{"$f":"IF('HVAC Unitary'!E25=\"\",\"\",'HVAC Unitary'!E25)","v":""},{"$f":"IF('HVAC Unitary'!F25=\"\",\"\",'HVAC Unitary'!F25)","v":""},{"$f":"IF('HVAC Unitary'!G25=\"\",\"\",'HVAC Unitary'!G25)","v":""},{"$f":"IF('HVAC Unitary'!K25=\"\",\"\",'HVAC Unitary'!K25)","v":""},{"$f":"IF('HVAC Unitary'!J25=\"\",\"\",'HVAC Unitary'!J25)","v":""},{"$f":"IF('HVAC Unitary'!L25=\"\",\"\",'HVAC Unitary'!L25)","v":""},"",{"$f":"IF('HVAC Unitary'!M25=\"\",\"\",'HVAC Unitary'!M25)","v":""},{"$f":"IF('HVAC Unitary'!N25=\"\",\"\",'HVAC Unitary'!N25)","v":0}]
[null,{"$f":"IF('HVAC Unitary'!D26=\"\",\"\",'HVAC Unitary'!D26)","v":""},{"$f":"IF('HVAC Unitary'!E26=\"\",\"\",'HVAC Unitary'!E26)","v":""},{"$f":"IF('HVAC Unitary'!F26=\"\",\"\",'HVAC Unitary'!F26)","v":""},{"$f":"IF('HVAC Unitary'!G26=\"\",\"\",'HVAC Unitary'!G26)","v":""},{"$f":"IF('HVAC Unitary'!K26=\"\",\"\",'HVAC Unitary'!K26)","v":""},{"$f":"IF('HVAC Unitary'!J26=\"\",\"\",'HVAC Unitary'!J26)","v":""},{"$f":"IF('HVAC Unitary'!L26=\"\",\"\",'HVAC Unitary'!L26)","v":""},"",{"$f":"IF('HVAC Unitary'!M26=\"\",\"\",'HVAC Unitary'!M26)","v":""},{"$f":"IF('HVAC Unitary'!N26=\"\",\"\",'HVAC Unitary'!N26)","v":0}]
[null,{"$f":"IF('HVAC Unitary'!D27=\"\",\"\",'HVAC Unitary'!D27)","v":""},{"$f":"IF('HVAC Unitary'!E27=\"\",\"\",'HVAC Unitary'!E27)","v":""},{"$f":"IF('HVAC Unitary'!F27=\"\",\"\",'HVAC Unitary'!F27)","v":""},{"$f":"IF('HVAC Unitary'!G27=\"\",\"\",'HVAC Unitary'!G27)","v":""},{"$f":"IF('HVAC Unitary'!K27=\"\",\"\",'HVAC Unitary'!K27)","v":""},{"$f":"IF('HVAC Unitary'!J27=\"\",\"\",'HVAC Unitary'!J27)","v":""},{"$f":"IF('HVAC Unitary'!L27=\"\",\"\",'HVAC Unitary'!L27)","v":""},"",{"$f":"IF('HVAC Unitary'!M27=\"\",\"\",'HVAC Unitary'!M27)","v":""},{"$f":"IF('HVAC Unitary'!N27=\"\",\"\",'HVAC Unitary'!N27)","v":0}]
[null,{"$f":"IF('HVAC Unitary'!D28=\"\",\"\",'HVAC Unitary'!D28)","v":""},{"$f":"IF('HVAC Unitary'!E28=\"\",\"\",'HVAC Unitary'!E28)","v":""},{"$f":"IF('HVAC Unitary'!F28=\"\",\"\",'HVAC Unitary'!F28)","v":""},{"$f":"IF('HVAC Unitary'!G28=\"\",\"\",'HVAC Unitary'!G28)","v":""},{"$f":"IF('HVAC Unitary'!K28=\"\",\"\",'HVAC Unitary'!K28)","v":""},{"$f":"IF('HVAC Unitary'!J28=\"\",\"\",'HVAC Unitary'!J28)","v":""},{"$f":"IF('HVAC Unitary'!L28=\"\",\"\",'HVAC Unitary'!L28)","v":""},"",{"$f":"IF('HVAC Unitary'!M28=\"\",\"\",'HVAC Unitary'!M28)","v":""},{"$f":"IF('HVAC Unitary'!N28=\"\",\"\",'HVAC Unitary'!N28)","v":0}]
[null,{"$f":"IF('HVAC Unitary'!D29=\"\",\"\",'HVAC Unitary'!D29)","v":""},{"$f":"IF('HVAC Unitary'!E29=\"\",\"\",'HVAC Unitary'!E29)","v":""},{"$f":"IF('HVAC Unitary'!F29=\"\",\"\",'HVAC Unitary'!F29)","v":""},{"$f":"IF('HVAC Unitary'!G29=\"\",\"\",'HVAC Unitary'!G29)","v":""},{"$f":"IF('HVAC Unitary'!K29=\"\",\"\",'HVAC Unitary'!K29)","v":""},{"$f":"IF('HVAC Unitary'!J29=\"\",\"\",'HVAC Unitary'!J29)","v":""},{"$f":"IF('HVAC Unitary'!L29=\"\",\"\",'HVAC Unitary'!L29)","v":""},"",{"$f":"IF('HVAC Unitary'!M29=\"\",\"\",'HVAC Unitary'!M29)","v":""},{"$f":"IF('HVAC Unitary'!N29=\"\",\"\",'HVAC Unitary'!N29)","v":0}]
[null,{"$f":"IF('HVAC Unitary'!D30=\"\",\"\",'HVAC Unitary'!D30)","v":""},{"$f":"IF('HVAC Unitary'!E30=\"\",\"\",'HVAC Unitary'!E30)","v":""},{"$f":"IF('HVAC Unitary'!F30=\"\",\"\",'HVAC Unitary'!F30)","v":""},{"$f":"IF('HVAC Unitary'!G30=\"\",\"\",'HVAC Unitary'!G30)","v":""},{"$f":"IF('HVAC Unitary'!K30=\"\",\"\",'HVAC Unitary'!K30)","v":""},{"$f":"IF('HVAC Unitary'!J30=\"\",\"\",'HVAC Unitary'!J30)","v":""},{"$f":"IF('HVAC Unitary'!L30=\"\",\"\",'HVAC Unitary'!L30)","v":""},"",{"$f":"IF('HVAC Unitary'!M30=\"\",\"\",'HVAC Unitary'!M30)","v":""},{"$f":"IF('HVAC Unitary'!N30=\"\",\"\",'HVAC Unitary'!N30)","v":0}]
[null,{"$f":"IF('HVAC Unitary'!D31=\"\",\"\",'HVAC Unitary'!D31)","v":""},{"$f":"IF('HVAC Unitary'!E31=\"\",\"\",'HVAC Unitary'!E31)","v":""},{"$f":"IF('HVAC Unitary'!F31=\"\",\"\",'HVAC Unitary'!F31)","v":""},{"$f":"IF('HVAC Unitary'!G31=\"\",\"\",'HVAC Unitary'!G31)","v":""},{"$f":"IF('HVAC Unitary'!K31=\"\",\"\",'HVAC Unitary'!K31)","v":""},{"$f":"IF('HVAC Unitary'!J31=\"\",\"\",'HVAC Unitary'!J31)","v":""},{"$f":"IF('HVAC Unitary'!L31=\"\",\"\",'HVAC Unitary'!L31)","v":""},"",{"$f":"IF('HVAC Unitary'!M31=\"\",\"\",'HVAC Unitary'!M31)","v":""},{"$f":"IF('HVAC Unitary'!N31=\"\",\"\",'HVAC Unitary'!N31)","v":0}]
[null,{"$f":"IF('HVAC Unitary'!D32=\"\",\"\",'HVAC Unitary'!D32)","v":""},{"$f":"IF('HVAC Unitary'!E32=\"\",\"\",'HVAC Unitary'!E32)","v":""},{"$f":"IF('HVAC Unitary'!F32=\"\",\"\",'HVAC Unitary'!F32)","v":""},{"$f":"IF('HVAC Unitary'!G32=\"\",\"\",'HVAC Unitary'!G32)","v":""},{"$f":"IF('HVAC Unitary'!K32=\"\",\"\",'HVAC Unitary'!K32)","v":""},{"$f":"IF('HVAC Unitary'!J32=\"\",\"\",'HVAC Unitary'!J32)","v":""},{"$f":"IF('HVAC Unitary'!L32=\"\",\"\",'HVAC Unitary'!L32)","v":""},"",{"$f":"IF('HVAC Unitary'!M32=\"\",\"\",'HVAC Unitary'!M32)","v":""},{"$f":"IF('HVAC Unitary'!N32=\"\",\"\",'HVAC Unitary'!N32)","v":0}]
[null,null,null,null,null,null,null,null,"Total Pre-approved Incentive",null,{"$f":"SUM(K20:K29)","v":0}]

{"sheet":"Version Tracking","index":28,"n_rows":42,"n_cols":5,"rows_kept":42,"cut":false,"hidden":true,"merged":[]}
[]
[]
[]
[null,"Current:",{"$f":"LOOKUP(2,1/(B1:B49991<>\"\"),B1:B49991)","v":"15.2"}]
[null,"Version","Notes","Date","Updated By"]
[null,2.1,"All editing and revisions required","2015-09-24","JZ"]
[null,2.2000000000000002,"Added formulas to calculate incentives","2015-09-25","RC"]
[null,2.2999999999999998,"Removed link to external workbook","2015-09-29","RM"]
[null,2.4,"Formatting, added buttons for tab, adjusted based on Jennifer's feedback","2015-10-21","RM"]
[null,2.5,"Added equipment tab instructions, changed tab colors, minor edits","2015-10-22","JZ"]
[null,2.6,"Added equipment buttons","2015-10-22","RM"]
[null,2.7,"Minor content edits","2015-10-27","Jennifer Mosser"]
[null,2.8,"Minor edits and fix radio button on CI tab","2015-11-20","JZ and RM"]
[null,2.9,"Additional minor edits","2015-11-20","JZ and RC"]
[null,3,"Increased >1 ton PTHP COP requirement and adjusted formulas","2016-02-29","RC"]
[null,3.1,"Fixed text on Equipment Input Instructions tab","2016-09-14","RC"]
[null,3.2,"Updated unitary and chiller incentives for 2017","2017-01-18","RC"]
[null,3.3,"Added additonal contact.  Changed Project Informaiton tab title from Customer Information tab.  Formatting","2017-01-20","JZ"]
[null,3.4,"Increased ACC VFD performance incentive cap","2017-01-23","RC"]
[null,3.5,"reduced incentives, increased ACC VFD IPLV","2017-02-02","RC"]
[null,3.6,"Revisions requested by Annika Goodson","2017-02-02","Mary Freibert"]
[null,3.7,"Language revisions and fixed buttons","2017-11-13","RC"]
[null,3.8,"Updated efficiency requirements","2018-07-17","RC"]
[null,3.9,"Final efficiency requirements","2018-07-31","RC"]
[null,10.1,"Updated Dominion Branding and T&Cs","2020-08-27","JSE"]
[null,10.199999999999999,"Updated Cap, and adjusted incentive ammounts","2021-02-16","JSE"]
[null,10.3,"fixed incentive calculator ","2021-03-19","JSE"]
[null,10.3,"I renamed the Input tab to HVAC Unitary, and moved the incentive guidance to this tab.  This will allow input data to nom longer need to be transcribed.\nAlso removed many of the superflous fields on the AEG import tab","3/99/2021","mds"]
[null,10.4,"Fixed incentives for Heatpump up dated PY11 Table","2021-03-26","JSE"]
[null,10.5,"Sixed incentive for VFDs < 1HP","2021-03-31"]
[null,10.6,"Added Cool Roof calculator tab","2021-07-27","Sean Creel"]
[null,10.7,"Added cool roof savings calculations and AEG import for cool roof and window film. ","2022-03-22","JME"]
[null,10.8,"Updated AEG import to be total savings and incentives and not based on a per unit amount /\nUpdated Eligibility language on T&Cs and added w-9 and invoicing requirements","2022-09-15","JME / LS"]
[null,10.9,"Updated efficiency requirements on HVAC application. Added model request on VFD/Cool Roof/Window Film tabs. \nReworked HVAC measures to be calculated savings and incorporate new SEER ratings","2023-03-22","LS / JME"]
[null,"10.10","Fixed formula for HSPF conversion to COP on min requirements","2023-05-21","JME"]
[null,"10.11","Fixed proposed PTHP heating efficiency calcs","2023-08-09","JME"]
[null,"10.12","Updated Email and Website. Updated Cool Roof requirements. Fixed incentive calculation error in table on HVAC unitary tab","2023-09-14","LS / JME"]
[null,"14.1","Updated the calculator to reflect latest  TRM changes","2023-11-20","Thomaskutty Jaison"]
[null,"14.2","Fixed email and radio buttons. ","2024-02-16","LS"]
[null,"14.3","Fixed Email, MC Summary, added IF statement to HVAC calcs for negative kW, Updated Technical Req for HVAC unitary tab. ","2024-03-25","LS"]
[null,"15.1","Updated workbook formatting and added HPWH, ARC, and GREM measures.","2025-03-09","LS / JME"]
[null,"15.2","Added savings calc for Chiller and VFD and have updated AEG import tab as well. Updated PTAC/PTHP baselines to align with CEAM for size ranges but left qualification requirements as per current offerings","2025-06-13","TKJ/JME"]

{"sheet":"Old Summary","index":29,"n_rows":42,"n_cols":11,"rows_kept":42,"cut":false,"hidden":true,"merged":[[1,1,1,10],[2,1,2,10],[5,1,5,10],[3,1,3,10],[4,1,4,10],[8,1,8,10],[20,1,20,10],[21,10,22,10],[10,3,10,4],[11,3,11,4],[12,3,12,4],[17,8,19,8],[17,10,19,10],[21,8,22,8],[13,3,13,4],[17,9,19,9],[17,4,19,4],[38,3,40,3],[16,1,16,10],[21,1,22,1],[33,3,35,3],[21,9,22,9],[17,5,19,5],[17,6,19,6],[17,7,19,7],[37,1,37,10],[32,1,32,10],[27,1,27,10],[17,1,18,2],[17,3,19,3],[21,2,22,2],[21,6,22,6],[21,5,22,5]]}
[]
[]
[]
[null,"Measure Summary"]
[null,{"$f":"\"Version # \"&'Version Tracking'!C4","v":"Version # 15.2"}]
[null," "]
[null,"Copyright © 2010 ICF Resources, LLC, All Rights Reserved. Do not copy, distribute or quote without ICF’s written permission."]
[]
[null,"Required General Project Information"]
[]
[null,null,"Project Name",{"$f":"IF('HVAC Unitary'!D11=\"\",\"\",'HVAC Unitary'!D11)","v":""},null,null,"Prepared By",{"$f":"IF('HVAC Unitary'!G11=\"\",\"\",'HVAC Unitary'!G11)","v":""}]
[null,null,"Project Address",{"$f":"IF('HVAC Unitary'!D12=\"\",\"\",'HVAC Unitary'!D12)","v":""},null,null,"Contact Person",{"$f":"IF('HVAC Unitary'!G12=\"\",\"\",'HVAC Unitary'!G12)","v":""}]
[null,null,"City",{"$f":"IF('HVAC Unitary'!D13=\"\",\"\",'HVAC Unitary'!D13)","v":""},null,null,"Phone",{"$f":"IF('HVAC Unitary'!G13=\"\",\"\",'HVAC Unitary'!G13)","v":""}]
[null,null,"ZIP",{"$f":"IF('HVAC Unitary'!D14=\"\",\"\",'HVAC Unitary'!D14)","v":""},null,null,"Email",{"$f":"IF('HVAC Unitary'!G14=\"\",\"\",'HVAC Unitary'!G14)","v":""}]
[]
[]
[null,"Unitary HVAC Measures and Incentives"]
[null,"Size Category (Tons)",null,"Sub-Category","Tier 1 Minimum Requirement","Tier 1 Quantity","Tier 1 Incentive","Tier 2 Minimum Requirement","Tier 2 Quantity","Tier 2 Incentive","Total Incentive"]
[]
[null,"Minimum Size (Greater Than or Equal To)","Maximum Size (Less Than, Not Equal To)"]
[null,"Air Conditioners and Heat Pumps (Cooling Mode) - Unitary and Matched Split Systems"]
[null,0,5.4,"Split System","14.0 SEER and 12.0 EER",{"$f":"SUMIF('HVAC Unitary'!#REF!,\"Tier 1_Unitary_\"&$B22,'HVAC Unitary'!$M$23:$M$32)","v":{"$error":"#REF!"}},"$20 / ton","15.0 SEER and 12.5 EER",{"$f":"SUMIF('HVAC Unitary'!#REF!,\"Tier 2_Unitary_\"&$B22,'HVAC Unitary'!$M$23:$M$32)","v":{"$error":"#REF!"}},"$30 / ton",{"$f":"SUMIF('HVAC Unitary'!#REF!,\"Tier 1_Unitary_\"&$B22,'HVAC Unitary'!$S$23:$S$32)+SUMIF('HVAC Unitary'!#REF!,\"Tier 2_Unitary_\"&$B22,'HVAC Unitary'!$S$23:$S$32)","v":{"$error":"#REF!"}}]
[null,null,null,"Single Package","14.0 SEER and 11.6 EER",null,null,"15.0 SEER and 12.0 EER"]
[null,5.4,20,"Split System and Single Package","11.5 EER and 11.7 IEER",{"$f":"SUMIF('HVAC Unitary'!#REF!,\"Tier 1_Unitary_\"&$B24,'HVAC Unitary'!$M$23:$M$32)","v":{"$error":"#REF!"}},"$20 / ton","12.0 EER and 12.2 IEER",{"$f":"SUMIF('HVAC Unitary'!#REF!,\"Tier 2_Unitary_\"&$B24,'HVAC Unitary'!$M$23:$M$32)","v":{"$error":"#REF!"}},"$30 / ton",{"$f":"SUMIF('HVAC Unitary'!#REF!,\"Tier 1_Unitary_\"&$B24,'HVAC Unitary'!$S$23:$S$32)+SUMIF('HVAC Unitary'!#REF!,\"Tier 2_Unitary_\"&$B24,'HVAC Unitary'!$S$23:$S$32)","v":{"$error":"#REF!"}}]
[null,20,63,"Split System and Single Package","10.5 EER and 10.6 IEER",{"$f":"SUMIF('HVAC Unitary'!#REF!,\"Tier 1_Unitary_\"&$B25,'HVAC Unitary'!$M$23:$M$32)","v":{"$error":"#REF!"}},"$20 / ton","10.85 EER and 11.0 IEER",{"$f":"SUMIF('HVAC Unitary'!#REF!,\"Tier 2_Unitary_\"&$B25,'HVAC Unitary'!$M$23:$M$32)","v":{"$error":"#REF!"}},"$30 / ton",{"$f":"SUMIF('HVAC Unitary'!#REF!,\"Tier 1_Unitary_\"&$B25,'HVAC Unitary'!$S$23:$S$32)+SUMIF('HVAC Unitary'!#REF!,\"Tier 2_Unitary_\"&$B25,'HVAC Unitary'!$S$23:$S$32)","v":{"$error":"#REF!"}}]
[null,63,null,"Split System and Single Package","9.7 EER and 9.8 IEER",{"$f":"SUMIF('HVAC Unitary'!#REF!,\"Tier 1_Unitary_\"&$B26,'HVAC Unitary'!$M$23:$M$32)","v":{"$error":"#REF!"}},"$10 / ton","10.2 EER and 10.3 IEER",{"$f":"SUMIF('HVAC Unitary'!#REF!,\"Tier 2_Unitary_\"&$B26,'HVAC Unitary'!$M$23:$M$32)","v":{"$error":"#REF!"}},"$15 / ton",{"$f":"SUMIF('HVAC Unitary'!#REF!,\"Tier 1_Unitary_\"&$B26,'HVAC Unitary'!$S$23:$S$32)+SUMIF('HVAC Unitary'!#REF!,\"Tier 2_Unitary_\"&$B26,'HVAC Unitary'!$S$23:$S$32)","v":{"$error":"#REF!"}}]
[]
[null,"Air Conditioners and Heat Pumps (Cooling Mode) - Water and Evaporative"]
[null,0,5.4,"Split System and Single Package","14.0 EER and 14.2 IEER",{"$f":"SUMIF('HVAC Unitary'!#REF!,\"Tier 1_Water_\"&$B29,'HVAC Unitary'!$M$23:$M$32)","v":{"$error":"#REF!"}},"$30 / ton","N/A",{"$f":"SUMIF('HVAC Unitary'!#REF!,\"Tier 2_Water_\"&$B29,'HVAC Unitary'!$M$23:$M$32)","v":{"$error":"#REF!"}},"N/A",{"$f":"SUMIF('HVAC Unitary'!#REF!,\"Tier 1_Water_\"&$B29,'HVAC Unitary'!$S$23:$S$32)+SUMIF('HVAC Unitary'!#REF!,\"Tier 2_Water_\"&$B29,'HVAC Unitary'!$S$23:$S$32)","v":{"$error":"#REF!"}}]
[null,5.4,11.25,"Split System and Single Package","14.0 EER and 14.2 IEER",{"$f":"SUMIF('HVAC Unitary'!#REF!,\"Tier 1_Water_\"&$B30,'HVAC Unitary'!$M$23:$M$32)","v":{"$error":"#REF!"}},"$30 / ton","N/A",{"$f":"SUMIF('HVAC Unitary'!#REF!,\"Tier 2_Water_\"&$B30,'HVAC Unitary'!$M$23:$M$32)","v":{"$error":"#REF!"}},"N/A",{"$f":"SUMIF('HVAC Unitary'!#REF!,\"Tier 1_Water_\"&$B30,'HVAC Unitary'!$S$23:$S$32)+SUMIF('HVAC Unitary'!#REF!,\"Tier 2_Water_\"&$B30,'HVAC Unitary'!$S$23:$S$32)","v":{"$error":"#REF!"}}]
[null,11.25,null,"Split System and Single Package","14.0 EER and 14.2 IEER",{"$f":"SUMIF('HVAC Unitary'!#REF!,\"Tier 1_Water_\"&$B31,'HVAC Unitary'!$M$23:$M$32)","v":{"$error":"#REF!"}},"$30 / ton","N/A",{"$f":"SUMIF('HVAC Unitary'!#REF!,\"Tier 2_Water_\"&$B31,'HVAC Unitary'!$M$23:$M$32)","v":{"$error":"#REF!"}},"N/A",{"$f":"SUMIF('HVAC Unitary'!#REF!,\"Tier 1_Water_\"&$B31,'HVAC Unitary'!$S$23:$S$32)+SUMIF('HVAC Unitary'!#REF!,\"Tier 2_Water_\"&$B31,'HVAC Unitary'!$S$23:$S$32)","v":{"$error":"#REF!"}}]
[]
[null,"Packaged Terminal Air Conditioner (PTAC)"]
[null,0,0.75,"Single Package","11.8 EER",{"$f":"SUMIF('HVAC Unitary'!#REF!,\"Tier 1_PTAC_\"&$B34,'HVAC Unitary'!$M$23:$M$32)","v":{"$error":"#REF!"}},"$10 / ton","N/A",{"$f":"SUMIF('HVAC Unitary'!#REF!,\"Tier 2_PTAC_\"&$B34,'HVAC Unitary'!$M$23:$M$32)","v":{"$error":"#REF!"}},"N/A",{"$f":"SUMIF('HVAC Unitary'!#REF!,\"Tier 1_PTAC_\"&$B34,'HVAC Unitary'!$S$23:$S$32)+SUMIF('HVAC Unitary'!#REF!,\"Tier 2_PTAC_\"&$B34,'HVAC Unitary'!$S$23:$S$32)","v":{"$error":"#REF!"}}]
[null,0.75,1,null,"11.0 EER",{"$f":"SUMIF('HVAC Unitary'!#REF!,\"Tier 1_PTAC_\"&$B35,'HVAC Unitary'!$M$23:$M$32)","v":{"$error":"#REF!"}},"$15 / ton","N/A",{"$f":"SUMIF('HVAC Unitary'!#REF!,\"Tier 2_PTAC_\"&$B35,'HVAC Unitary'!$M$23:$M$32)","v":{"$error":"#REF!"}},"N/A",{"$f":"SUMIF('HVAC Unitary'!#REF!,\"Tier 1_PTAC_\"&$B35,'HVAC Unitary'!$S$23:$S$32)+SUMIF('HVAC Unitary'!#REF!,\"Tier 2_PTAC_\"&$B35,'HVAC Unitary'!$S$23:$S$32)","v":{"$error":"#REF!"}}]
[null,1,null,null,"10.3 EER",{"$f":"SUMIF('HVAC Unitary'!#REF!,\"Tier 1_PTAC_\"&$B36,'HVAC Unitary'!$M$23:$M$32)","v":{"$error":"#REF!"}},"$20 / ton","N/A",{"$f":"SUMIF('HVAC Unitary'!#REF!,\"Tier 2_PTAC_\"&$B36,'HVAC Unitary'!$M$23:$M$32)","v":{"$error":"#REF!"}},"N/A",{"$f":"SUMIF('HVAC Unitary'!#REF!,\"Tier 1_PTAC_\"&$B36,'HVAC Unitary'!$S$23:$S$32)+SUMIF('HVAC Unitary'!#REF!,\"Tier 2_PTAC_\"&$B36,'HVAC Unitary'!$S$23:$S$32)","v":{"$error":"#REF!"}}]
[]
[null,"Packaged Terminal Heat Pump (PTHP)"]
[null,0,0.75,"Single Package","11.5 EER and 3.3 COP",{"$f":"SUMIF('HVAC Unitary'!#REF!,\"Tier 1_PTHP_\"&$B39,'HVAC Unitary'!$M$23:$M$32)","v":{"$error":"#REF!"}},"$10 / ton","N/A",{"$f":"SUMIF('HVAC Unitary'!#REF!,\"Tier 2_PTHP_\"&$B39,'HVAC Unitary'!$M$23:$M$32)","v":{"$error":"#REF!"}},"N/A",{"$f":"SUMIF('HVAC Unitary'!#REF!,\"Tier 1_PTHP_\"&$B39,'HVAC Unitary'!$S$23:$S$32)+SUMIF('HVAC Unitary'!#REF!,\"Tier 2_PTHP_\"&$B39,'HVAC Unitary'!$S$23:$S$32)","v":{"$error":"#REF!"}}]
[null,0.75,1,null,"10.8 EER and 3.2 COP",{"$f":"SUMIF('HVAC Unitary'!#REF!,\"Tier 1_PTHP_\"&$B40,'HVAC Unitary'!$M$23:$M$32)","v":{"$error":"#REF!"}},"$15 / ton","N/A",{"$f":"SUMIF('HVAC Unitary'!#REF!,\"Tier 2_PTHP_\"&$B40,'HVAC Unitary'!$M$23:$M$32)","v":{"$error":"#REF!"}},"N/A",{"$f":"SUMIF('HVAC Unitary'!#REF!,\"Tier 1_PTHP_\"&$B40,'HVAC Unitary'!$S$23:$S$32)+SUMIF('HVAC Unitary'!#REF!,\"Tier 2_PTHP_\"&$B40,'HVAC Unitary'!$S$23:$S$32)","v":{"$error":"#REF!"}}]
[null,1,null,null,"10.1 EER and 3.1 COP",{"$f":"SUMIF('HVAC Unitary'!#REF!,\"Tier 1_PTHP_\"&$B41,'HVAC Unitary'!$M$23:$M$32)","v":{"$error":"#REF!"}},"$20 / ton","N/A",{"$f":"SUMIF('HVAC Unitary'!#REF!,\"Tier 2_PTHP_\"&$B41,'HVAC Unitary'!$M$23:$M$32)","v":{"$error":"#REF!"}},"N/A",{"$f":"SUMIF('HVAC Unitary'!#REF!,\"Tier 1_PTHP_\"&$B41,'HVAC Unitary'!$S$23:$S$32)+SUMIF('HVAC Unitary'!#REF!,\"Tier 2_PTHP_\"&$B41,'HVAC Unitary'!$S$23:$S$32)","v":{"$error":"#REF!"}}]
[null,null,null,null,null,null,null,null,null,"Total Incentive",{"$f":"SUM(K22:K41)","v":{"$error":"#REF!"}}]

{"sheet":"Attribute Crosswalk","index":30,"n_rows":60,"n_cols":7,"rows_kept":60,"cut":false,"hidden":true,"merged":[[1,0,19,0],[22,0,40,0],[43,0,59,0]]}
["Product Name","Attribute","Plain English Description","Default Value","Validation Type",null,"In AEG Import Template"]
["Heat-pump Water Heater","ELEC_UTIL_CUST_INCENTIVE","Incentive per Unit","","Numeric",null,"New attributes needed"]
[null,"KWH_IMPACT","kWh Savings per Unit","","Numeric"]
[null,"MODEL","Model","","Text"]
[null,"INSTALL_TYPE_SEL","Control Type","","Text"]
[null,"CUSTOMER_REFID","Measure Code","HPWH","Text"]
[null,"KW_WINTER_1","Winter Peak Demand Savings","","Numeric"]
[null,"KW_SUMMER_GROSS","",""]
[null,"UEF","UEF",null,"Numeric"]
[null,"BUILDING_TYPE_SEL","Building Type","","Text"]
[null,"BACKUP_TANK_GALLON","Storage size",null,"Numeric"]
[null,"CALCULATOR_VERSION","Calculator Version",null,"Text"]
[null,"Quantity","Quantity",null,"Numeric"]
[null,"MANUFACTURER","Manufacturer","","Text"]
[null,"INCENTIVE_PER_UNIT","Incentive per Unit","","Numeric"]
[null,"KW_IMPACT","Winter Peak Demand Savings","","Numeric"]
[null,"NATURAL_GAS_SAVINGS_MMBTU","","","Numeric"]
[null,"MEASURE_LIFE","Measure Life","","Numeric"]
[null,"Draw_Pattern","Draw Pattern","","Text"]
[null,"Location","HPWH Location","","Text"]
[]
["Product Name","Attribute","Plain English Description","Default Value","Validation Type"]
["Advanced Rooftop Control (ARC)","MEASURE_LIFE","Measure Life","","Numeric"]
[null,"CALCULATOR_VERSION","Calculator Version",null,"Text"]
[null,"CUSTOMER_REFID","Measure Code","ARC","Text"]
[null,"TONS","",""]
[null,"KWH_IMPACT","kWh Savings per Unit","","Numeric"]
[null,"INCENTIVE_PER_UNIT","Incentive per Unit","","Numeric"]
[null,"ELEC_UTIL_CUST_INCENTIVE","Incentive per Unit","","Numeric"]
[null,"MANUFACTURER","Manufacturer","","Text"]
[null,"KW_SUMMER_GROSS","",""]
[null,"KW_IMPACT","Winter Peak Demand Savings","","Numeric"]
[null,"NATURAL_GAS_SAVINGS_MMBTU","","","Numeric"]
[null,"BUILDING_TYPE_SEL","Building Type","","Text"]
[null,"INSTALL_TYPE_SEL","Control Type","","Text"]
[null,"MODEL","Model","","Text"]
[null,"KW_WINTER_1","Winter Peak Demand Savings","","Numeric"]
[null,"Quantity","Quantity",null,"Numeric"]
[null,"heating_cap_btuh","Heating Capacity (btuh)",null,"Numeric"]
[null,"cooling_cap_btuh","Cooling Capacity (btuh)",null,"Numeric"]
[null,"heating_type","Heating Type",null,"Text"]
[]
["Product Name","Attribute","Plain English Description","Default Value","Validation Type"]
["Guestroom Controls","NATURAL_GAS_SAVINGS_MMBTU","","","Numeric"]
[null,"BUILDING_TYPE_SEL","Building Type","","Text"]
[null,"Quantity","Quantity",null,"Numeric"]
[null,"KW_SUMMER_GROSS","",""]
[null,"KWH_IMPACT","kWh Savings per Unit","","Numeric"]
[null,"CONTROL_TYPE","Temperature Control Setback/Setup"]
[null,"TYPE_SEL","HVAC Type"]
[null,"INCENTIVE_PER_UNIT","Incentive per Unit","","Numeric"]
[null,"KW_WINTER_1","Winter Peak Demand Savings","","Numeric"]
[null,"MANUFACTURER","Manufacturer","","Text"]
[null,"INSTALL_TYPE_SEL","Controlled Equipment","","Text"]
[null,"KW_IMPACT","Winter Peak Demand Savings","","Numeric"]
[null,"ELEC_UTIL_CUST_INCENTIVE","Incentive per Unit","","Numeric"]
[null,"CALCULATOR_VERSION","Calculator Version",null,"Text"]
[null,"CUSTOMER_REFID","Measure Code","GRC","Text"]
[null,"MODEL","Model","","Text"]
[null,"MEASURE_LIFE","Measure Life","","Numeric"]

{"sheet":"AEG Import","index":31,"n_rows":100,"n_cols":45,"rows_kept":100,"cut":false,"hidden":true,"merged":[]}
["Measure #","Import?","CALCULATOR_VERSION","building_type_sel","EER","SEER","COP","EER_2","SEER_2","HSPF_2","Full_Load","Half_Load","Base_incentive_Per_Unit","Base_Total_incentive_Per_Unit","Performance_Incentive_Per_Unit","Performance_Total_Incentive_Per_Unit","Elec_Util_cust_Incentive","Incentive_Per_Unit","kW_Impact","kW_Summer_Gross","KW_WINTER_1","kWh_Impact","Manufacturer","Measure_Life","Model","name","quantity","Tons","SUB_COMPONENT_1","SUB_COMPONENT_2","Square_feet","SHGC","INSTALL_TYPE_SEL","Horse_Power","heating_cap_btuh","cooling_cap_btuh","heating_type","CUSTOMER_REFID","Control_Type","Control_Type","UEF","BACKUP_TANK_GALLON","Location","Control_Type_sel","Draw_Pattern"]
[null,"No","HVAC Unitary"]
[{"$f":"VLOOKUP(Z3,Validation!$C$3:$D$9,2,FALSE)","v":{"$error":"#N/A"}},{"$f":"IF(Q3=0,\"No\",\"Yes\")","v":"No"},{"$f":"'Version Tracking'!$C$4","v":"15.2"},{"$f":"'HVAC Unitary'!C23","v":0},{"$f":"IF(IF(OR(HVACCalcs!$K5=\"Old\",HVACCalcs!$K5=\"\"),'HVAC Unitary'!J23,\"\")=0,\"\",IF(OR(HVACCalcs!$K5=\"Old\",HVACCalcs!$K5=\"\"),'HVAC Unitary'!J23,\"\"))","v":""},{"$f":"IF(IF(OR(HVACCalcs!$K5=\"Old\",HVACCalcs!$K5=\"\"),'HVAC Unitary'!K23,\"\")=0,\"\",IF(OR(HVACCalcs!$K5=\"Old\",HVACCalcs!$K5=\"\"),'HVAC Unitary'!K23,\"\"))","v":""},{"$f":"IF(IF(OR(HVACCalcs!$K5=\"Old\",HVACCalcs!$K5=\"\"),'HVAC Unitary'!L23,\"\")=0,\"\",IF(OR(HVACCalcs!$K5=\"Old\",HVACCalcs!$K5=\"\"),'HVAC Unitary'!L23,\"\"))","v":""},{"$f":"IF(IF(HVACCalcs!$K5=\"New\",'HVAC Unitary'!J23,\"\")=0,\"\",IF(HVACCalcs!$K5=\"New\",'HVAC Unitary'!J23,\"\"))","v":""},{"$f":"IF(IF(HVACCalcs!$K5=\"New\",'HVAC Unitary'!K23,\"\")=0,\"\",IF(HVACCalcs!$K5=\"New\",'HVAC Unitary'!K23,\"\"))","v":""},{"$f":"IF(IF(HVACCalcs!$K5=\"New\",'HVAC Unitary'!L23,\"\")=0,\"\",IF(HVACCalcs!$K5=\"New\",'HVAC Unitary'!L23,\"\"))","v":""},null,null,null,null,null,null,{"$f":"IF(ISERROR('HVAC Unitary'!S23/IF(AA3=0,1,AA3)),\" \",'HVAC Unitary'!S23/IF(AA3=0,1,AA3))","v":0},{"$f":"'HVAC Unitary'!T23","v":0},{"$f":"U3","v":0},{"$f":"'HVAC Unitary'!Q23/IF(AA3=0,1,AA3)","v":0},{"$f":"'HVAC Unitary'!R23/IF(AA3=0,1,AA3)","v":0},{"$f":"'HVAC Unitary'!P23/IF(AA3=0,1,AA3)","v":0},{"$f":"'HVAC Unitary'!E23","v":0},15,{"$f":"'HVAC Unitary'!F23","v":0},{"$f":"'HVAC Unitary'!D23","v":0},{"$f":"'HVAC Unitary'!M23","v":0},{"$f":"'HVAC Unitary'!G23","v":0}]
[{"$f":"VLOOKUP(Z4,Validation!$C$3:$D$9,2,FALSE)","v":{"$error":"#N/A"}},{"$f":"IF(Q4=0,\"No\",\"Yes\")","v":"No"},{"$f":"'Version Tracking'!$C$4","v":"15.2"},{"$f":"'HVAC Unitary'!C24","v":0},{"$f":"IF(IF(OR(HVACCalcs!$K6=\"Old\",HVACCalcs!$K6=\"\"),'HVAC Unitary'!J24,\"\")=0,\"\",IF(OR(HVACCalcs!$K6=\"Old\",HVACCalcs!$K6=\"\"),'HVAC Unitary'!J24,\"\"))","v":""},{"$f":"IF(IF(OR(HVACCalcs!$K6=\"Old\",HVACCalcs!$K6=\"\"),'HVAC Unitary'!K24,\"\")=0,\"\",IF(OR(HVACCalcs!$K6=\"Old\",HVACCalcs!$K6=\"\"),'HVAC Unitary'!K24,\"\"))","v":""},{"$f":"IF(IF(OR(HVACCalcs!$K6=\"Old\",HVACCalcs!$K6=\"\"),'HVAC Unitary'!L24,\"\")=0,\"\",IF(OR(HVACCalcs!$K6=\"Old\",HVACCalcs!$K6=\"\"),'HVAC Unitary'!L24,\"\"))","v":""},{"$f":"IF(IF(HVACCalcs!$K6=\"New\",'HVAC Unitary'!J24,\"\")=0,\"\",IF(HVACCalcs!$K6=\"New\",'HVAC Unitary'!J24,\"\"))","v":""},{"$f":"IF(IF(HVACCalcs!$K6=\"New\",'HVAC Unitary'!K24,\"\")=0,\"\",IF(HVACCalcs!$K6=\"New\",'HVAC Unitary'!K24,\"\"))","v":""},{"$f":"IF(IF(HVACCalcs!$K6=\"New\",'HVAC Unitary'!L24,\"\")=0,\"\",IF(HVACCalcs!$K6=\"New\",'HVAC Unitary'!L24,\"\"))","v":""},null,null,null,null,null,null,{"$f":"IF(ISERROR('HVAC Unitary'!S24/IF(AA4=0,1,AA4)),\" \",'HVAC Unitary'!S24/IF(AA4=0,1,AA4))","v":0},{"$f":"'HVAC Unitary'!T24","v":0},0,{"$f":"'HVAC Unitary'!Q24/IF(AA4=0,1,AA4)","v":0},{"$f":"'HVAC Unitary'!R24/IF(AA4=0,1,AA4)","v":0},{"$f":"'HVAC Unitary'!P24/IF(AA4=0,1,AA4)","v":0},{"$f":"'HVAC Unitary'!E24","v":0},15,{"$f":"'HVAC Unitary'!F24","v":0},{"$f":"'HVAC Unitary'!D24","v":0},{"$f":"'HVAC Unitary'!M24","v":0},{"$f":"'HVAC Unitary'!G24","v":0}]
[{"$f":"VLOOKUP(Z5,Validation!$C$3:$D$9,2,FALSE)","v":{"$error":"#N/A"}},"No",{"$f":"'Version Tracking'!$C$4","v":"15.2"},{"$f":"'HVAC Unitary'!C25","v":0},{"$f":"IF(IF(OR(HVACCalcs!$K7=\"Old\",HVACCalcs!$K7=\"\"),'HVAC Unitary'!J25,\"\")=0,\"\",IF(OR(HVACCalcs!$K7=\"Old\",HVACCalcs!$K7=\"\"),'HVAC Unitary'!J25,\"\"))","v":""},{"$f":"IF(IF(OR(HVACCalcs!$K7=\"Old\",HVACCalcs!$K7=\"\"),'HVAC Unitary'!K25,\"\")=0,\"\",IF(OR(HVACCalcs!$K7=\"Old\",HVACCalcs!$K7=\"\"),'HVAC Unitary'!K25,\"\"))","v":""},{"$f":"IF(IF(OR(HVACCalcs!$K7=\"Old\",HVACCalcs!$K7=\"\"),'HVAC Unitary'!L25,\"\")=0,\"\",IF(OR(HVACCalcs!$K7=\"Old\",HVACCalcs!$K7=\"\"),'HVAC Unitary'!L25,\"\"))","v":""},{"$f":"IF(IF(HVACCalcs!$K7=\"New\",'HVAC Unitary'!J25,\"\")=0,\"\",IF(HVACCalcs!$K7=\"New\",'HVAC Unitary'!J25,\"\"))","v":""},{"$f":"IF(IF(HVACCalcs!$K7=\"New\",'HVAC Unitary'!K25,\"\")=0,\"\",IF(HVACCalcs!$K7=\"New\",'HVAC Unitary'!K25,\"\"))","v":""},{"$f":"IF(IF(HVACCalcs!$K7=\"New\",'HVAC Unitary'!L25,\"\")=0,\"\",IF(HVACCalcs!$K7=\"New\",'HVAC Unitary'!L25,\"\"))","v":""},null,null,null,null,null,null,{"$f":"IF(ISERROR('HVAC Unitary'!S25/IF(AA5=0,1,AA5)),\" \",'HVAC Unitary'!S25/IF(AA5=0,1,AA5))","v":0},{"$f":"'HVAC Unitary'!T25","v":0},0,{"$f":"'HVAC Unitary'!Q25/IF(AA5=0,1,AA5)","v":0},{"$f":"'HVAC Unitary'!R25/IF(AA5=0,1,AA5)","v":0},{"$f":"'HVAC Unitary'!P25/IF(AA5=0,1,AA5)","v":0},{"$f":"'HVAC Unitary'!E25","v":0},15,{"$f":"'HVAC Unitary'!F25","v":0},{"$f":"'HVAC Unitary'!D25","v":0},{"$f":"'HVAC Unitary'!M25","v":0},{"$f":"'HVAC Unitary'!G25","v":0}]
[{"$f":"VLOOKUP(Z6,Validation!$C$3:$D$9,2,FALSE)","v":{"$error":"#N/A"}},"No",{"$f":"'Version Tracking'!$C$4","v":"15.2"},{"$f":"'HVAC Unitary'!C26","v":0},{"$f":"IF(IF(OR(HVACCalcs!$K8=\"Old\",HVACCalcs!$K8=\"\"),'HVAC Unitary'!J26,\"\")=0,\"\",IF(OR(HVACCalcs!$K8=\"Old\",HVACCalcs!$K8=\"\"),'HVAC Unitary'!J26,\"\"))","v":""},{"$f":"IF(IF(OR(HVACCalcs!$K8=\"Old\",HVACCalcs!$K8=\"\"),'HVAC Unitary'!K26,\"\")=0,\"\",IF(OR(HVACCalcs!$K8=\"Old\",HVACCalcs!$K8=\"\"),'HVAC Unitary'!K26,\"\"))","v":""},{"$f":"IF(IF(OR(HVACCalcs!$K8=\"Old\",HVACCalcs!$K8=\"\"),'HVAC Unitary'!L26,\"\")=0,\"\",IF(OR(HVACCalcs!$K8=\"Old\",HVACCalcs!$K8=\"\"),'HVAC Unitary'!L26,\"\"))","v":""},{"$f":"IF(IF(HVACCalcs!$K8=\"New\",'HVAC Unitary'!J26,\"\")=0,\"\",IF(HVACCalcs!$K8=\"New\",'HVAC Unitary'!J26,\"\"))","v":""},{"$f":"IF(IF(HVACCalcs!$K8=\"New\",'HVAC Unitary'!K26,\"\")=0,\"\",IF(HVACCalcs!$K8=\"New\",'HVAC Unitary'!K26,\"\"))","v":""},{"$f":"IF(IF(HVACCalcs!$K8=\"New\",'HVAC Unitary'!L26,\"\")=0,\"\",IF(HVACCalcs!$K8=\"New\",'HVAC Unitary'!L26,\"\"))","v":""},null,null,null,null,null,null,{"$f":"IF(ISERROR('HVAC Unitary'!S26/IF(AA6=0,1,AA6)),\" \",'HVAC Unitary'!S26/IF(AA6=0,1,AA6))","v":0},{"$f":"'HVAC Unitary'!T26","v":0},0,{"$f":"'HVAC Unitary'!Q26/IF(AA6=0,1,AA6)","v":0},{"$f":"'HVAC Unitary'!R26/IF(AA6=0,1,AA6)","v":0},{"$f":"'HVAC Unitary'!P26/IF(AA6=0,1,AA6)","v":0},{"$f":"'HVAC Unitary'!E26","v":0},15,{"$f":"'HVAC Unitary'!F26","v":0},{"$f":"'HVAC Unitary'!D26","v":0},{"$f":"'HVAC Unitary'!M26","v":0},{"$f":"'HVAC Unitary'!G26","v":0}]
[{"$f":"VLOOKUP(Z7,Validation!$C$3:$D$9,2,FALSE)","v":{"$error":"#N/A"}},"No",{"$f":"'Version Tracking'!$C$4","v":"15.2"},{"$f":"'HVAC Unitary'!C27","v":0},{"$f":"IF(IF(OR(HVACCalcs!$K9=\"Old\",HVACCalcs!$K9=\"\"),'HVAC Unitary'!J27,\"\")=0,\"\",IF(OR(HVACCalcs!$K9=\"Old\",HVACCalcs!$K9=\"\"),'HVAC Unitary'!J27,\"\"))","v":""},{"$f":"IF(IF(OR(HVACCalcs!$K9=\"Old\",HVACCalcs!$K9=\"\"),'HVAC Unitary'!K27,\"\")=0,\"\",IF(OR(HVACCalcs!$K9=\"Old\",HVACCalcs!$K9=\"\"),'HVAC Unitary'!K27,\"\"))","v":""},{"$f":"IF(IF(OR(HVACCalcs!$K9=\"Old\",HVACCalcs!$K9=\"\"),'HVAC Unitary'!L27,\"\")=0,\"\",IF(OR(HVACCalcs!$K9=\"Old\",HVACCalcs!$K9=\"\"),'HVAC Unitary'!L27,\"\"))","v":""},{"$f":"IF(IF(HVACCalcs!$K9=\"New\",'HVAC Unitary'!J27,\"\")=0,\"\",IF(HVACCalcs!$K9=\"New\",'HVAC Unitary'!J27,\"\"))","v":""},{"$f":"IF(IF(HVACCalcs!$K9=\"New\",'HVAC Unitary'!K27,\"\")=0,\"\",IF(HVACCalcs!$K9=\"New\",'HVAC Unitary'!K27,\"\"))","v":""},{"$f":"IF(IF(HVACCalcs!$K9=\"New\",'HVAC Unitary'!L27,\"\")=0,\"\",IF(HVACCalcs!$K9=\"New\",'HVAC Unitary'!L27,\"\"))","v":""},null,null,null,null,null,null,{"$f":"IF(ISERROR('HVAC Unitary'!S27/IF(AA7=0,1,AA7)),\" \",'HVAC Unitary'!S27/IF(AA7=0,1,AA7))","v":0},{"$f":"'HVAC Unitary'!T27","v":0},0,{"$f":"'HVAC Unitary'!Q27/IF(AA7=0,1,AA7)","v":0},{"$f":"'HVAC Unitary'!R27/IF(AA7=0,1,AA7)","v":0},{"$f":"'HVAC Unitary'!P27/IF(AA7=0,1,AA7)","v":0},{"$f":"'HVAC Unitary'!E27","v":0},15,{"$f":"'HVAC Unitary'!F27","v":0},{"$f":"'HVAC Unitary'!D27","v":0},{"$f":"'HVAC Unitary'!M27","v":0},{"$f":"'HVAC Unitary'!G27","v":0}]
[{"$f":"VLOOKUP(Z8,Validation!$C$3:$D$9,2,FALSE)","v":{"$error":"#N/A"}},"No",{"$f":"'Version Tracking'!$C$4","v":"15.2"},{"$f":"'HVAC Unitary'!C28","v":0},{"$f":"IF(IF(OR(HVACCalcs!$K10=\"Old\",HVACCalcs!$K10=\"\"),'HVAC Unitary'!J28,\"\")=0,\"\",IF(OR(HVACCalcs!$K10=\"Old\",HVACCalcs!$K10=\"\"),'HVAC Unitary'!J28,\"\"))","v":""},{"$f":"IF(IF(OR(HVACCalcs!$K10=\"Old\",HVACCalcs!$K10=\"\"),'HVAC Unitary'!K28,\"\")=0,\"\",IF(OR(HVACCalcs!$K10=\"Old\",HVACCalcs!$K10=\"\"),'HVAC Unitary'!K28,\"\"))","v":""},{"$f":"IF(IF(OR(HVACCalcs!$K10=\"Old\",HVACCalcs!$K10=\"\"),'HVAC Unitary'!L28,\"\")=0,\"\",IF(OR(HVACCalcs!$K10=\"Old\",HVACCalcs!$K10=\"\"),'HVAC Unitary'!L28,\"\"))","v":""},{"$f":"IF(IF(HVACCalcs!$K10=\"New\",'HVAC Unitary'!J28,\"\")=0,\"\",IF(HVACCalcs!$K10=\"New\",'HVAC Unitary'!J28,\"\"))","v":""},{"$f":"IF(IF(HVACCalcs!$K10=\"New\",'HVAC Unitary'!K28,\"\")=0,\"\",IF(HVACCalcs!$K10=\"New\",'HVAC Unitary'!K28,\"\"))","v":""},{"$f":"IF(IF(HVACCalcs!$K10=\"New\",'HVAC Unitary'!L28,\"\")=0,\"\",IF(HVACCalcs!$K10=\"New\",'HVAC Unitary'!L28,\"\"))","v":""},null,null,null,null,null,null,{"$f":"IF(ISERROR('HVAC Unitary'!S28/IF(AA8=0,1,AA8)),\" \",'HVAC Unitary'!S28/IF(AA8=0,1,AA8))","v":0},{"$f":"'HVAC Unitary'!T28","v":0},0,{"$f":"'HVAC Unitary'!Q28/IF(AA8=0,1,AA8)","v":0},{"$f":"'HVAC Unitary'!R28/IF(AA8=0,1,AA8)","v":0},{"$f":"'HVAC Unitary'!P28/IF(AA8=0,1,AA8)","v":0},{"$f":"'HVAC Unitary'!E28","v":0},15,{"$f":"'HVAC Unitary'!F28","v":0},{"$f":"'HVAC Unitary'!D28","v":0},{"$f":"'HVAC Unitary'!M28","v":0},{"$f":"'HVAC Unitary'!G28","v":0}]
[{"$f":"VLOOKUP(Z9,Validation!$C$3:$D$9,2,FALSE)","v":{"$error":"#N/A"}},"No",{"$f":"'Version Tracking'!$C$4","v":"15.2"},{"$f":"'HVAC Unitary'!C29","v":0},{"$f":"IF(IF(OR(HVACCalcs!$K11=\"Old\",HVACCalcs!$K11=\"\"),'HVAC Unitary'!J29,\"\")=0,\"\",IF(OR(HVACCalcs!$K11=\"Old\",HVACCalcs!$K11=\"\"),'HVAC Unitary'!J29,\"\"))","v":""},{"$f":"IF(IF(OR(HVACCalcs!$K11=\"Old\",HVACCalcs!$K11=\"\"),'HVAC Unitary'!K29,\"\")=0,\"\",IF(OR(HVACCalcs!$K11=\"Old\",HVACCalcs!$K11=\"\"),'HVAC Unitary'!K29,\"\"))","v":""},{"$f":"IF(IF(OR(HVACCalcs!$K11=\"Old\",HVACCalcs!$K11=\"\"),'HVAC Unitary'!L29,\"\")=0,\"\",IF(OR(HVACCalcs!$K11=\"Old\",HVACCalcs!$K11=\"\"),'HVAC Unitary'!L29,\"\"))","v":""},{"$f":"IF(IF(HVACCalcs!$K11=\"New\",'HVAC Unitary'!J29,\"\")=0,\"\",IF(HVACCalcs!$K11=\"New\",'HVAC Unitary'!J29,\"\"))","v":""},{"$f":"IF(IF(HVACCalcs!$K11=\"New\",'HVAC Unitary'!K29,\"\")=0,\"\",IF(HVACCalcs!$K11=\"New\",'HVAC Unitary'!K29,\"\"))","v":""},{"$f":"IF(IF(HVACCalcs!$K11=\"New\",'HVAC Unitary'!L29,\"\")=0,\"\",IF(HVACCalcs!$K11=\"New\",'HVAC Unitary'!L29,\"\"))","v":""},null,null,null,null,null,null,{"$f":"IF(ISERROR('HVAC Unitary'!S29/IF(AA9=0,1,AA9)),\" \",'HVAC Unitary'!S29/IF(AA9=0,1,AA9))","v":0},{"$f":"'HVAC Unitary'!T29","v":0},0,{"$f":"'HVAC Unitary'!Q29/IF(AA9=0,1,AA9)","v":0},{"$f":"'HVAC Unitary'!R29/IF(AA9=0,1,AA9)","v":0},{"$f":"'HVAC Unitary'!P29/IF(AA9=0,1,AA9)","v":0},{"$f":"'HVAC Unitary'!E29","v":0},15,{"$f":"'HVAC Unitary'!F29","v":0},{"$f":"'HVAC Unitary'!D29","v":0},{"$f":"'HVAC Unitary'!M29","v":0},{"$f":"'HVAC Unitary'!G29","v":0}]
[{"$f":"VLOOKUP(Z10,Validation!$C$3:$D$9,2,FALSE)","v":{"$error":"#N/A"}},"No",{"$f":"'Version Tracking'!$C$4","v":"15.2"},{"$f":"'HVAC Unitary'!C30","v":0},{"$f":"IF(IF(OR(HVACCalcs!$K12=\"Old\",HVACCalcs!$K12=\"\"),'HVAC Unitary'!J30,\"\")=0,\"\",IF(OR(HVACCalcs!$K12=\"Old\",HVACCalcs!$K12=\"\"),'HVAC Unitary'!J30,\"\"))","v":""},{"$f":"IF(IF(OR(HVACCalcs!$K12=\"Old\",HVACCalcs!$K12=\"\"),'HVAC Unitary'!K30,\"\")=0,\"\",IF(OR(HVACCalcs!$K12=\"Old\",HVACCalcs!$K12=\"\"),'HVAC Unitary'!K30,\"\"))","v":""},{"$f":"IF(IF(OR(HVACCalcs!$K12=\"Old\",HVACCalcs!$K12=\"\"),'HVAC Unitary'!L30,\"\")=0,\"\",IF(OR(HVACCalcs!$K12=\"Old\",HVACCalcs!$K12=\"\"),'HVAC Unitary'!L30,\"\"))","v":""},{"$f":"IF(IF(HVACCalcs!$K12=\"New\",'HVAC Unitary'!J30,\"\")=0,\"\",IF(HVACCalcs!$K12=\"New\",'HVAC Unitary'!J30,\"\"))","v":""},{"$f":"IF(IF(HVACCalcs!$K12=\"New\",'HVAC Unitary'!K30,\"\")=0,\"\",IF(HVACCalcs!$K12=\"New\",'HVAC Unitary'!K30,\"\"))","v":""},{"$f":"IF(IF(HVACCalcs!$K12=\"New\",'HVAC Unitary'!L30,\"\")=0,\"\",IF(HVACCalcs!$K12=\"New\",'HVAC Unitary'!L30,\"\"))","v":""},null,null,null,null,null,null,{"$f":"IF(ISERROR('HVAC Unitary'!S30/IF(AA10=0,1,AA10)),\" \",'HVAC Unitary'!S30/IF(AA10=0,1,AA10))","v":0},{"$f":"'HVAC Unitary'!T30","v":0},0,{"$f":"'HVAC Unitary'!Q30/IF(AA10=0,1,AA10)","v":0},{"$f":"'HVAC Unitary'!R30/IF(AA10=0,1,AA10)","v":0},{"$f":"'HVAC Unitary'!P30/IF(AA10=0,1,AA10)","v":0},{"$f":"'HVAC Unitary'!E30","v":0},15,{"$f":"'HVAC Unitary'!F30","v":0},{"$f":"'HVAC Unitary'!D30","v":0},{"$f":"'HVAC Unitary'!M30","v":0},{"$f":"'HVAC Unitary'!G30","v":0}]
[{"$f":"VLOOKUP(Z11,Validation!$C$3:$D$9,2,FALSE)","v":{"$error":"#N/A"}},"No",{"$f":"'Version Tracking'!$C$4","v":"15.2"},{"$f":"'HVAC Unitary'!C31","v":0},{"$f":"IF(IF(OR(HVACCalcs!$K13=\"Old\",HVACCalcs!$K13=\"\"),'HVAC Unitary'!J31,\"\")=0,\"\",IF(OR(HVACCalcs!$K13=\"Old\",HVACCalcs!$K13=\"\"),'HVAC Unitary'!J31,\"\"))","v":""},{"$f":"IF(IF(OR(HVACCalcs!$K13=\"Old\",HVACCalcs!$K13=\"\"),'HVAC Unitary'!K31,\"\")=0,\"\",IF(OR(HVACCalcs!$K13=\"Old\",HVACCalcs!$K13=\"\"),'HVAC Unitary'!K31,\"\"))","v":""},{"$f":"IF(IF(OR(HVACCalcs!$K13=\"Old\",HVACCalcs!$K13=\"\"),'HVAC Unitary'!L31,\"\")=0,\"\",IF(OR(HVACCalcs!$K13=\"Old\",HVACCalcs!$K13=\"\"),'HVAC Unitary'!L31,\"\"))","v":""},{"$f":"IF(IF(HVACCalcs!$K13=\"New\",'HVAC Unitary'!J31,\"\")=0,\"\",IF(HVACCalcs!$K13=\"New\",'HVAC Unitary'!J31,\"\"))","v":""},{"$f":"IF(IF(HVACCalcs!$K13=\"New\",'HVAC Unitary'!K31,\"\")=0,\"\",IF(HVACCalcs!$K13=\"New\",'HVAC Unitary'!K31,\"\"))","v":""},{"$f":"IF(IF(HVACCalcs!$K13=\"New\",'HVAC Unitary'!L31,\"\")=0,\"\",IF(HVACCalcs!$K13=\"New\",'HVAC Unitary'!L31,\"\"))","v":""},null,null,null,null,null,null,{"$f":"IF(ISERROR('HVAC Unitary'!S31/IF(AA11=0,1,AA11)),\" \",'HVAC Unitary'!S31/IF(AA11=0,1,AA11))","v":0},{"$f":"'HVAC Unitary'!T31","v":0},0,{"$f":"'HVAC Unitary'!Q31/IF(AA11=0,1,AA11)","v":0},{"$f":"'HVAC Unitary'!R31/IF(AA11=0,1,AA11)","v":0},{"$f":"'HVAC Unitary'!P31/IF(AA11=0,1,AA11)","v":0},{"$f":"'HVAC Unitary'!E31","v":0},15,{"$f":"'HVAC Unitary'!F31","v":0},{"$f":"'HVAC Unitary'!D31","v":0},{"$f":"'HVAC Unitary'!M31","v":0},{"$f":"'HVAC Unitary'!G31","v":0}]
[{"$f":"VLOOKUP(Z12,Validation!$C$3:$D$9,2,FALSE)","v":{"$error":"#N/A"}},"No",{"$f":"'Version Tracking'!$C$4","v":"15.2"},{"$f":"'HVAC Unitary'!C32","v":0},{"$f":"IF(IF(OR(HVACCalcs!$K14=\"Old\",HVACCalcs!$K14=\"\"),'HVAC Unitary'!J32,\"\")=0,\"\",IF(OR(HVACCalcs!$K14=\"Old\",HVACCalcs!$K14=\"\"),'HVAC Unitary'!J32,\"\"))","v":""},{"$f":"IF(IF(OR(HVACCalcs!$K14=\"Old\",HVACCalcs!$K14=\"\"),'HVAC Unitary'!K32,\"\")=0,\"\",IF(OR(HVACCalcs!$K14=\"Old\",HVACCalcs!$K14=\"\"),'HVAC Unitary'!K32,\"\"))","v":""},{"$f":"IF(IF(OR(HVACCalcs!$K14=\"Old\",HVACCalcs!$K14=\"\"),'HVAC Unitary'!L32,\"\")=0,\"\",IF(OR(HVACCalcs!$K14=\"Old\",HVACCalcs!$K14=\"\"),'HVAC Unitary'!L32,\"\"))","v":""},{"$f":"IF(IF(HVACCalcs!$K14=\"New\",'HVAC Unitary'!J32,\"\")=0,\"\",IF(HVACCalcs!$K14=\"New\",'HVAC Unitary'!J32,\"\"))","v":""},{"$f":"IF(IF(HVACCalcs!$K14=\"New\",'HVAC Unitary'!K32,\"\")=0,\"\",IF(HVACCalcs!$K14=\"New\",'HVAC Unitary'!K32,\"\"))","v":""},{"$f":"IF(IF(HVACCalcs!$K14=\"New\",'HVAC Unitary'!L32,\"\")=0,\"\",IF(HVACCalcs!$K14=\"New\",'HVAC Unitary'!L32,\"\"))","v":""},null,null,null,null,null,null,{"$f":"IF(ISERROR('HVAC Unitary'!S32/IF(AA12=0,1,AA12)),\" \",'HVAC Unitary'!S32/IF(AA12=0,1,AA12))","v":0},{"$f":"'HVAC Unitary'!T32","v":0},0,{"$f":"'HVAC Unitary'!Q32/IF(AA12=0,1,AA12)","v":0},{"$f":"'HVAC Unitary'!R32/IF(AA12=0,1,AA12)","v":0},{"$f":"'HVAC Unitary'!P32/IF(AA12=0,1,AA12)","v":0},{"$f":"'HVAC Unitary'!E32","v":0},15,{"$f":"'HVAC Unitary'!F32","v":0},{"$f":"'HVAC Unitary'!D32","v":0},{"$f":"'HVAC Unitary'!M32","v":0},{"$f":"'HVAC Unitary'!G32","v":0}]
[null,"No","Cool Roof Measures"]
["CR",{"$f":"IF(OR('Cool Roof'!H5=0,'Cool Roof'!H5=\"Fill in zip code in cell L6 on Project Information tab\"),\"No\",\"Yes\")","v":"No"},{"$f":"'Version Tracking'!$C$4","v":"15.2"},{"$f":"'Cool Roof'!A5","v":0},null,null,null,null,null,null,null,null,null,null,null,null,{"$f":"'Cool Roof'!G5*'Cool Roof'!F5","v":0},0.1,{"$f":"'Cool Roof'!O5","v":0},{"$f":"S14","v":0},{"$f":"T14","v":0},{"$f":"'Cool Roof'!N5","v":0},{"$f":"'Cool Roof'!B5","v":0},{"$f":"IF('Cool Roof'!C5=\"New Roof\",15,10)","v":10},null,"Cool Roof",{"$f":"IF(B14=\"Yes\", 1, \"\")","v":""},null,{"$f":"'Cool Roof'!D5","v":0},{"$f":"'Cool Roof'!E5","v":0},{"$f":"'Cool Roof'!F5","v":0},null,null,null,null,null,null,null,null,null,null,null,{"$f":"'Cool Roof'!K5","v":""}]
["CR",{"$f":"IF('Cool Roof'!H6=0,\"No\",\"Yes\")","v":"No"},{"$f":"'Version Tracking'!$C$4","v":"15.2"},{"$f":"'Cool Roof'!A6","v":0},null,null,null,null,null,null,null,null,null,null,null,null,{"$f":"'Cool Roof'!G6*'Cool Roof'!F6","v":0},0.1,{"$f":"'Cool Roof'!O6","v":0},{"$f":"S15","v":0},{"$f":"T15","v":0},{"$f":"'Cool Roof'!N6","v":0},{"$f":"'Cool Roof'!B6","v":0},{"$f":"IF('Cool Roof'!C6=\"New Roof\",15,10)","v":10},null,"Cool Roof",{"$f":"IF(B15=\"Yes\", 1, \"\")","v":""},null,{"$f":"'Cool Roof'!D6","v":0},{"$f":"'Cool Roof'!E6","v":0},{"$f":"'Cool Roof'!F6","v":0},null,null,null,null,null,null,null,null,null,null,null,{"$f":"'Cool Roof'!K6","v":""}]
["CR",{"$f":"IF('Cool Roof'!H7=0,\"No\",\"Yes\")","v":"No"},{"$f":"'Version Tracking'!$C$4","v":"15.2"},{"$f":"'Cool Roof'!A7","v":0},null,null,null,null,null,null,null,null,null,null,null,null,{"$f":"'Cool Roof'!G7*'Cool Roof'!F7","v":0},0.1,{"$f":"'Cool Roof'!O7","v":0},{"$f":"S16","v":0},0,{"$f":"'Cool Roof'!N7","v":0},{"$f":"'Cool Roof'!B7","v":0},{"$f":"IF('Cool Roof'!C7=\"New Roof\",15,10)","v":10},null,"Cool Roof",{"$f":"IF(B16=\"Yes\", 1, \"\")","v":""},null,{"$f":"'Cool Roof'!D7","v":0},{"$f":"'Cool Roof'!E7","v":0},{"$f":"'Cool Roof'!F7","v":0},null,null,null,null,null,null,null,null,null,null,null,{"$f":"'Cool Roof'!K7","v":""}]
["CR",{"$f":"IF('Cool Roof'!H8=0,\"No\",\"Yes\")","v":"No"},{"$f":"'Version Tracking'!$C$4","v":"15.2"},{"$f":"'Cool Roof'!A8","v":0},null,null,null,null,null,null,null,null,null,null,null,null,{"$f":"'Cool Roof'!G8*'Cool Roof'!F8","v":0},0.1,{"$f":"'Cool Roof'!O8","v":0},{"$f":"S17","v":0},0,{"$f":"'Cool Roof'!N8","v":0},{"$f":"'Cool Roof'!B8","v":0},{"$f":"IF('Cool Roof'!C8=\"New Roof\",15,10)","v":10},null,"Cool Roof",{"$f":"IF(B17=\"Yes\", 1, \"\")","v":""},null,{"$f":"'Cool Roof'!D8","v":0},{"$f":"'Cool Roof'!E8","v":0},{"$f":"'Cool Roof'!F8","v":0},null,null,null,null,null,null,null,null,null,null,null,{"$f":"'Cool Roof'!K8","v":""}]
[null,"No","Window Film Measures"]
["WF",{"$f":"IF('Window Film'!I5=0,\"No\",\"Yes\")","v":"No"},{"$f":"'Version Tracking'!$C$4","v":"15.2"},{"$f":"'Window Film'!A5","v":0},null,null,null,null,null,null,null,null,null,null,null,null,{"$f":"'Window Film'!L5*'Window Film'!C5","v":0},1,{"$f":"'Window Film'!R5","v":0},{"$f":"S19","v":0},0,{"$f":"'Window Film'!Q5","v":0},{"$f":"'Window Film'!E5","v":0},15,null,"Window Film",{"$f":"IF(B19=\"Yes\", 1, \"\")","v":""},null,null,null,{"$f":"'Window Film'!C5","v":0},{"$f":"'Window Film'!F5","v":0}]
["WF",{"$f":"IF('Window Film'!I6=0,\"No\",\"Yes\")","v":"No"},{"$f":"'Version Tracking'!$C$4","v":"15.2"},{"$f":"'Window Film'!A6","v":0},null,null,null,null,null,null,null,null,null,null,null,null,{"$f":"'Window Film'!L6*'Window Film'!C6","v":0},1,{"$f":"'Window Film'!R6","v":0},0,0,{"$f":"'Window Film'!Q6","v":0},{"$f":"'Window Film'!E6","v":0},15,null,"Window Film",{"$f":"IF(B20=\"Yes\", 1, \"\")","v":""},null,null,null,{"$f":"'Window Film'!C6","v":0},{"$f":"'Window Film'!F6","v":0}]
["WF",{"$f":"IF('Window Film'!I7=0,\"No\",\"Yes\")","v":"No"},{"$f":"'Version Tracking'!$C$4","v":"15.2"},{"$f":"'Window Film'!A7","v":0},null,null,null,null,null,null,null,null,null,null,null,null,{"$f":"'Window Film'!L7*'Window Film'!C7","v":0},1,{"$f":"'Window Film'!R7","v":0},0,0,{"$f":"'Window Film'!Q7","v":0},{"$f":"'Window Film'!E7","v":0},15,null,"Window Film",{"$f":"IF(B21=\"Yes\", 1, \"\")","v":""},null,null,null,{"$f":"'Window Film'!C7","v":0},{"$f":"'Window Film'!F7","v":0}]
["WF",{"$f":"IF('Window Film'!I8=0,\"No\",\"Yes\")","v":"No"},{"$f":"'Version Tracking'!$C$4","v":"15.2"},{"$f":"'Window Film'!A8","v":0},null,null,null,null,null,null,null,null,null,null,null,null,{"$f":"'Window Film'!L8*'Window Film'!C8","v":0},1,{"$f":"'Window Film'!R8","v":0},0,0,{"$f":"'Window Film'!Q8","v":0},{"$f":"'Window Film'!E8","v":0},15,null,"Window Film",{"$f":"IF(B22=\"Yes\", 1, \"\")","v":""},null,null,null,{"$f":"'Window Film'!C8","v":0},{"$f":"'Window Film'!F8","v":0}]
[null,"No","Advanced RTU Controls"]
["ARC",{"$f":"IF('ARC Calculations'!U9=\"Yes\",\"Yes\",\"No\")","v":"No"},{"$f":"'Version Tracking'!$C$4","v":"15.2"},{"$f":"'ARC Calculations'!A9","v":0},null,null,null,null,null,null,null,null,null,null,null,null,{"$f":"'ARC Calculations'!V9","v":0},{"$f":"Q24","v":0},{"$f":"U24","v":{"$error":"#DIV/0!"}},null,{"$f":"'ARC Calculations'!AA9","v":{"$error":"#DIV/0!"}},{"$f":"'ARC Calculations'!Z9","v":{"$error":"#DIV/0!"}},{"$f":"'ARC Calculations'!B9","v":0},10,{"$f":"'ARC Calculations'!C9","v":0},null,{"$f":"'ARC Calculations'!I9","v":0},null,null,null,null,null,{"$f":"'ARC Calculations'!D9","v":0},null,{"$f":"'ARC Calculations'!G9","v":0},{"$f":"'ARC Calculations'!H9","v":0},{"$f":"'ARC Calculations'!E9","v":0},"ARC"]
["ARC",{"$f":"IF('ARC Calculations'!U10=\"Yes\",\"Yes\",\"No\")","v":"No"},{"$f":"'Version Tracking'!$C$4","v":"15.2"},{"$f":"'ARC Calculations'!A10","v":0},null,null,null,null,null,null,null,null,null,null,null,null,{"$f":"'ARC Calculations'!V10","v":0},{"$f":"Q25","v":0},{"$f":"U25","v":{"$error":"#DIV/0!"}},null,{"$f":"'ARC Calculations'!AA10","v":{"$error":"#DIV/0!"}},{"$f":"'ARC Calculations'!Z10","v":{"$error":"#DIV/0!"}},{"$f":"'ARC Calculations'!B10","v":0},10,{"$f":"'ARC Calculations'!C10","v":0},null,{"$f":"'ARC Calculations'!I10","v":0},null,null,null,null,null,{"$f":"'ARC Calculations'!D10","v":0},null,{"$f":"'ARC Calculations'!G10","v":0},{"$f":"'ARC Calculations'!H10","v":0},{"$f":"'ARC Calculations'!E10","v":0},"ARC"]
["ARC",{"$f":"IF('ARC Calculations'!U11=\"Yes\",\"Yes\",\"No\")","v":"No"},{"$f":"'Version Tracking'!$C$4","v":"15.2"},{"$f":"'ARC Calculations'!A11","v":0},null,null,null,null,null,null,null,null,null,null,null,null,{"$f":"'ARC Calculations'!V11","v":0},0,{"$error":"#DIV/0!"},null,{"$f":"'ARC Calculations'!AA11","v":{"$error":"#DIV/0!"}},{"$f":"'ARC Calculations'!Z11","v":{"$error":"#DIV/0!"}},{"$f":"'ARC Calculations'!B11","v":0},10,{"$f":"'ARC Calculations'!C11","v":0},null,{"$f":"'ARC Calculations'!I11","v":0},null,null,null,null,null,{"$f":"'ARC Calculations'!D11","v":0},null,{"$f":"'ARC Calculations'!G11","v":0},{"$f":"'ARC Calculations'!H11","v":0},{"$f":"'ARC Calculations'!E11","v":0},"ARC"]
["ARC",{"$f":"IF('ARC Calculations'!U12=\"Yes\",\"Yes\",\"No\")","v":"No"},{"$f":"'Version Tracking'!$C$4","v":"15.2"},{"$f":"'ARC Calculations'!A12","v":0},null,null,null,null,null,null,null,null,null,null,null,null,{"$f":"'ARC Calculations'!V12","v":0},0,{"$error":"#DIV/0!"},null,{"$f":"'ARC Calculations'!AA12","v":{"$error":"#DIV/0!"}},{"$f":"'ARC Calculations'!Z12","v":{"$error":"#DIV/0!"}},{"$f":"'ARC Calculations'!B12","v":0},10,{"$f":"'ARC Calculations'!C12","v":0},null,{"$f":"'ARC Calculations'!I12","v":0},null,null,null,null,null,{"$f":"'ARC Calculations'!D12","v":0},null,{"$f":"'ARC Calculations'!G12","v":0},{"$f":"'ARC Calculations'!H12","v":0},{"$f":"'ARC Calculations'!E12","v":0},"ARC"]
["ARC",{"$f":"IF('ARC Calculations'!U13=\"Yes\",\"Yes\",\"No\")","v":"No"},{"$f":"'Version Tracking'!$C$4","v":"15.2"},{"$f":"'ARC Calculations'!A13","v":0},null,null,null,null,null,null,null,null,null,null,null,null,{"$f":"'ARC Calculations'!V13","v":0},0,{"$error":"#DIV/0!"},null,{"$f":"'ARC Calculations'!AA13","v":{"$error":"#DIV/0!"}},{"$f":"'ARC Calculations'!Z13","v":{"$error":"#DIV/0!"}},{"$f":"'ARC Calculations'!B13","v":0},10,{"$f":"'ARC Calculations'!C13","v":0},null,{"$f":"'ARC Calculations'!I13","v":0},null,null,null,null,null,{"$f":"'ARC Calculations'!D13","v":0},null,{"$f":"'ARC Calculations'!G13","v":0},{"$f":"'ARC Calculations'!H13","v":0},{"$f":"'ARC Calculations'!E13","v":0},"ARC"]
["ARC",{"$f":"IF('ARC Calculations'!U14=\"Yes\",\"Yes\",\"No\")","v":"No"},{"$f":"'Version Tracking'!$C$4","v":"15.2"},{"$f":"'ARC Calculations'!A14","v":0},null,null,null,null,null,null,null,null,null,null,null,null,{"$f":"'ARC Calculations'!V14","v":0},0,{"$error":"#DIV/0!"},null,{"$f":"'ARC Calculations'!AA14","v":{"$error":"#DIV/0!"}},{"$f":"'ARC Calculations'!Z14","v":{"$error":"#DIV/0!"}},{"$f":"'ARC Calculations'!B14","v":0},10,{"$f":"'ARC Calculations'!C14","v":0},null,{"$f":"'ARC Calculations'!I14","v":0},null,null,null,null,null,{"$f":"'ARC Calculations'!D14","v":0},null,{"$f":"'ARC Calculations'!G14","v":0},{"$f":"'ARC Calculations'!H14","v":0},{"$f":"'ARC Calculations'!E14","v":0},"ARC"]
["ARC",{"$f":"IF('ARC Calculations'!U15=\"Yes\",\"Yes\",\"No\")","v":"No"},{"$f":"'Version Tracking'!$C$4","v":"15.2"},{"$f":"'ARC Calculations'!A15","v":0},null,null,null,null,null,null,null,null,null,null,null,null,{"$f":"'ARC Calculations'!V15","v":0},0,{"$error":"#DIV/0!"},null,{"$f":"'ARC Calculations'!AA15","v":{"$error":"#DIV/0!"}},{"$f":"'ARC Calculations'!Z15","v":{"$error":"#DIV/0!"}},{"$f":"'ARC Calculations'!B15","v":0},10,{"$f":"'ARC Calculations'!C15","v":0},null,{"$f":"'ARC Calculations'!I15","v":0},null,null,null,null,null,{"$f":"'ARC Calculations'!D15","v":0},null,{"$f":"'ARC Calculations'!G15","v":0},{"$f":"'ARC Calculations'!H15","v":0},{"$f":"'ARC Calculations'!E15","v":0},"ARC"]
["ARC",{"$f":"IF('ARC Calculations'!U16=\"Yes\",\"Yes\",\"No\")","v":"No"},{"$f":"'Version Tracking'!$C$4","v":"15.2"},{"$f":"'ARC Calculations'!A16","v":0},null,null,null,null,null,null,null,null,null,null,null,null,{"$f":"'ARC Calculations'!V16","v":0},0,{"$error":"#DIV/0!"},null,{"$f":"'ARC Calculations'!AA16","v":{"$error":"#DIV/0!"}},{"$f":"'ARC Calculations'!Z16","v":{"$error":"#DIV/0!"}},{"$f":"'ARC Calculations'!B16","v":0},10,{"$f":"'ARC Calculations'!C16","v":0},null,{"$f":"'ARC Calculations'!I16","v":0},null,null,null,null,null,{"$f":"'ARC Calculations'!D16","v":0},null,{"$f":"'ARC Calculations'!G16","v":0},{"$f":"'ARC Calculations'!H16","v":0},{"$f":"'ARC Calculations'!E16","v":0},"ARC"]
["ARC",{"$f":"IF('ARC Calculations'!U17=\"Yes\",\"Yes\",\"No\")","v":"No"},{"$f":"'Version Tracking'!$C$4","v":"15.2"},{"$f":"'ARC Calculations'!A17","v":0},null,null,null,null,null,null,null,null,null,null,null,null,{"$f":"'ARC Calculations'!V17","v":0},0,{"$error":"#DIV/0!"},null,{"$f":"'ARC Calculations'!AA17","v":{"$error":"#DIV/0!"}},{"$f":"'ARC Calculations'!Z17","v":{"$error":"#DIV/0!"}},{"$f":"'ARC Calculations'!B17","v":0},10,{"$f":"'ARC Calculations'!C17","v":0},null,{"$f":"'ARC Calculations'!I17","v":0},null,null,null,null,null,{"$f":"'ARC Calculations'!D17","v":0},null,{"$f":"'ARC Calculations'!G17","v":0},{"$f":"'ARC Calculations'!H17","v":0},{"$f":"'ARC Calculations'!E17","v":0},"ARC"]
["ARC",{"$f":"IF('ARC Calculations'!U18=\"Yes\",\"Yes\",\"No\")","v":"No"},{"$f":"'Version Tracking'!$C$4","v":"15.2"},{"$f":"'ARC Calculations'!A18","v":0},null,null,null,null,null,null,null,null,null,null,null,null,{"$f":"'ARC Calculations'!V18","v":0},0,{"$error":"#DIV/0!"},null,{"$f":"'ARC Calculations'!AA18","v":{"$error":"#DIV/0!"}},{"$f":"'ARC Calculations'!Z18","v":{"$error":"#DIV/0!"}},{"$f":"'ARC Calculations'!B18","v":0},10,{"$f":"'ARC Calculations'!C18","v":0},null,{"$f":"'ARC Calculations'!I18","v":0},null,null,null,null,null,{"$f":"'ARC Calculations'!D18","v":0},null,{"$f":"'ARC Calculations'!G18","v":0},{"$f":"'ARC Calculations'!H18","v":0},{"$f":"'ARC Calculations'!E18","v":0},"ARC"]
["ARC",{"$f":"IF('ARC Calculations'!U19=\"Yes\",\"Yes\",\"No\")","v":"No"},{"$f":"'Version Tracking'!$C$4","v":"15.2"},{"$f":"'ARC Calculations'!A19","v":0},null,null,null,null,null,null,null,null,null,null,null,null,{"$f":"'ARC Calculations'!V19","v":0},0,{"$error":"#DIV/0!"},null,{"$f":"'ARC Calculations'!AA19","v":{"$error":"#DIV/0!"}},{"$f":"'ARC Calculations'!Z19","v":{"$error":"#DIV/0!"}},{"$f":"'ARC Calculations'!B19","v":0},10,{"$f":"'ARC Calculations'!C19","v":0},null,{"$f":"'ARC Calculations'!I19","v":0},null,null,null,null,null,{"$f":"'ARC Calculations'!D19","v":0},null,{"$f":"'ARC Calculations'!G19","v":0},{"$f":"'ARC Calculations'!H19","v":0},{"$f":"'ARC Calculations'!E19","v":0},"ARC"]
["ARC",{"$f":"IF('ARC Calculations'!U20=\"Yes\",\"Yes\",\"No\")","v":"No"},{"$f":"'Version Tracking'!$C$4","v":"15.2"},{"$f":"'ARC Calculations'!A20","v":0},null,null,null,null,null,null,null,null,null,null,null,null,{"$f":"'ARC Calculations'!V20","v":0},0,{"$error":"#DIV/0!"},null,{"$f":"'ARC Calculations'!AA20","v":{"$error":"#DIV/0!"}},{"$f":"'ARC Calculations'!Z20","v":{"$error":"#DIV/0!"}},{"$f":"'ARC Calculations'!B20","v":0},10,{"$f":"'ARC Calculations'!C20","v":0},null,{"$f":"'ARC Calculations'!I20","v":0},null,null,null,null,null,{"$f":"'ARC Calculations'!D20","v":0},null,{"$f":"'ARC Calculations'!G20","v":0},{"$f":"'ARC Calculations'!H20","v":0},{"$f":"'ARC Calculations'!E20","v":0},"ARC"]
["ARC",{"$f":"IF('ARC Calculations'!U21=\"Yes\",\"Yes\",\"No\")","v":"No"},{"$f":"'Version Tracking'!$C$4","v":"15.2"},{"$f":"'ARC Calculations'!A21","v":0},null,null,null,null,null,null,null,null,null,null,null,null,{"$f":"'ARC Calculations'!V21","v":0},0,{"$error":"#DIV/0!"},null,{"$f":"'ARC Calculations'!AA21","v":{"$error":"#DIV/0!"}},{"$f":"'ARC Calculations'!Z21","v":{"$error":"#DIV/0!"}},{"$f":"'ARC Calculations'!B21","v":0},10,{"$f":"'ARC Calculations'!C21","v":0},null,{"$f":"'ARC Calculations'!I21","v":0},null,null,null,null,null,{"$f":"'ARC Calculations'!D21","v":0},null,{"$f":"'ARC Calculations'!G21","v":0},{"$f":"'ARC Calculations'!H21","v":0},{"$f":"'ARC Calculations'!E21","v":0},"ARC"]
["ARC",{"$f":"IF('ARC Calculations'!U22=\"Yes\",\"Yes\",\"No\")","v":"No"},{"$f":"'Version Tracking'!$C$4","v":"15.2"},{"$f":"'ARC Calculations'!A22","v":0},null,null,null,null,null,null,null,null,null,null,null,null,{"$f":"'ARC Calculations'!V22","v":0},0,{"$error":"#DIV/0!"},null,{"$f":"'ARC Calculations'!AA22","v":{"$error":"#DIV/0!"}},{"$f":"'ARC Calculations'!Z22","v":{"$error":"#DIV/0!"}},{"$f":"'ARC Calculations'!B22","v":0},10,{"$f":"'ARC Calculations'!C22","v":0},null,{"$f":"'ARC Calculations'!I22","v":0},null,null,null,null,null,{"$f":"'ARC Calculations'!D22","v":0},null,{"$f":"'ARC Calculations'!G22","v":0},{"$f":"'ARC Calculations'!H22","v":0},{"$f":"'ARC Calculations'!E22","v":0},"ARC"]
["ARC",{"$f":"IF('ARC Calculations'!U23=\"Yes\",\"Yes\",\"No\")","v":"No"},{"$f":"'Version Tracking'!$C$4","v":"15.2"},{"$f":"'ARC Calculations'!A23","v":0},null,null,null,null,null,null,null,null,null,null,null,null,{"$f":"'ARC Calculations'!V23","v":0},0,{"$error":"#DIV/0!"},null,{"$f":"'ARC Calculations'!AA23","v":{"$error":"#DIV/0!"}},{"$f":"'ARC Calculations'!Z23","v":{"$error":"#DIV/0!"}},{"$f":"'ARC Calculations'!B23","v":0},10,{"$f":"'ARC Calculations'!C23","v":0},null,{"$f":"'ARC Calculations'!I23","v":0},null,null,null,null,null,{"$f":"'ARC Calculations'!D23","v":0},null,{"$f":"'ARC Calculations'!G23","v":0},{"$f":"'ARC Calculations'!H23","v":0},{"$f":"'ARC Calculations'!E23","v":0},"ARC"]
["ARC",{"$f":"IF('ARC Calculations'!U24=\"Yes\",\"Yes\",\"No\")","v":"No"},{"$f":"'Version Tracking'!$C$4","v":"15.2"},{"$f":"'ARC Calculations'!A24","v":0},null,null,null,null,null,null,null,null,null,null,null,null,{"$f":"'ARC Calculations'!V24","v":0},0,{"$error":"#DIV/0!"},null,{"$f":"'ARC Calculations'!AA24","v":{"$error":"#DIV/0!"}},{"$f":"'ARC Calculations'!Z24","v":{"$error":"#DIV/0!"}},{"$f":"'ARC Calculations'!B24","v":0},10,{"$f":"'ARC Calculations'!C24","v":0},null,{"$f":"'ARC Calculations'!I24","v":0},null,null,null,null,null,{"$f":"'ARC Calculations'!D24","v":0},null,{"$f":"'ARC Calculations'!G24","v":0},{"$f":"'ARC Calculations'!H24","v":0},{"$f":"'ARC Calculations'!E24","v":0},"ARC"]
["ARC",{"$f":"IF('ARC Calculations'!U25=\"Yes\",\"Yes\",\"No\")","v":"No"},{"$f":"'Version Tracking'!$C$4","v":"15.2"},{"$f":"'ARC Calculations'!A25","v":0},null,null,null,null,null,null,null,null,null,null,null,null,{"$f":"'ARC Calculations'!V25","v":0},0,{"$error":"#DIV/0!"},null,{"$f":"'ARC Calculations'!AA25","v":{"$error":"#DIV/0!"}},{"$f":"'ARC Calculations'!Z25","v":{"$error":"#DIV/0!"}},{"$f":"'ARC Calculations'!B25","v":0},10,{"$f":"'ARC Calculations'!C25","v":0},null,{"$f":"'ARC Calculations'!I25","v":0},null,null,null,null,null,{"$f":"'ARC Calculations'!D25","v":0},null,{"$f":"'ARC Calculations'!G25","v":0},{"$f":"'ARC Calculations'!H25","v":0},{"$f":"'ARC Calculations'!E25","v":0},"ARC"]
["ARC",{"$f":"IF('ARC Calculations'!U26=\"Yes\",\"Yes\",\"No\")","v":"No"},{"$f":"'Version Tracking'!$C$4","v":"15.2"},{"$f":"'ARC Calculations'!A26","v":0},null,null,null,null,null,null,null,null,null,null,null,null,{"$f":"'ARC Calculations'!V26","v":0},0,{"$error":"#DIV/0!"},null,{"$f":"'ARC Calculations'!AA26","v":{"$error":"#DIV/0!"}},{"$f":"'ARC Calculations'!Z26","v":{"$error":"#DIV/0!"}},{"$f":"'ARC Calculations'!B26","v":0},10,{"$f":"'ARC Calculations'!C26","v":0},null,{"$f":"'ARC Calculations'!I26","v":0},null,null,null,null,null,{"$f":"'ARC Calculations'!D26","v":0},null,{"$f":"'ARC Calculations'!G26","v":0},{"$f":"'ARC Calculations'!H26","v":0},{"$f":"'ARC Calculations'!E26","v":0},"ARC"]
["ARC",{"$f":"IF('ARC Calculations'!U27=\"Yes\",\"Yes\",\"No\")","v":"No"},{"$f":"'Version Tracking'!$C$4","v":"15.2"},{"$f":"'ARC Calculations'!A27","v":0},null,null,null,null,null,null,null,null,null,null,null,null,{"$f":"'ARC Calculations'!V27","v":0},0,{"$error":"#DIV/0!"},null,{"$f":"'ARC Calculations'!AA27","v":{"$error":"#DIV/0!"}},{"$f":"'ARC Calculations'!Z27","v":{"$error":"#DIV/0!"}},{"$f":"'ARC Calculations'!B27","v":0},10,{"$f":"'ARC Calculations'!C27","v":0},null,{"$f":"'ARC Calculations'!I27","v":0},null,null,null,null,null,{"$f":"'ARC Calculations'!D27","v":0},null,{"$f":"'ARC Calculations'!G27","v":0},{"$f":"'ARC Calculations'!H27","v":0},{"$f":"'ARC Calculations'!E27","v":0},"ARC"]
["ARC",{"$f":"IF('ARC Calculations'!U28=\"Yes\",\"Yes\",\"No\")","v":"No"},{"$f":"'Version Tracking'!$C$4","v":"15.2"},{"$f":"'ARC Calculations'!A28","v":0},null,null,null,null,null,null,null,null,null,null,null,null,{"$f":"'ARC Calculations'!V28","v":0},0,{"$error":"#DIV/0!"},null,{"$f":"'ARC Calculations'!AA28","v":{"$error":"#DIV/0!"}},{"$f":"'ARC Calculations'!Z28","v":{"$error":"#DIV/0!"}},{"$f":"'ARC Calculations'!B28","v":0},10,{"$f":"'ARC Calculations'!C28","v":0},null,{"$f":"'ARC Calculations'!I28","v":0},null,null,null,null,null,{"$f":"'ARC Calculations'!D28","v":0},null,{"$f":"'ARC Calculations'!G28","v":0},{"$f":"'ARC Calculations'!H28","v":0},{"$f":"'ARC Calculations'!E28","v":0},"ARC"]
[null,"No","Guestroom Energy Management"]
["GRC",{"$f":"IF('GREM Calculations'!K9=\"Yes\",\"Yes\",\"No\")","v":"No"},{"$f":"'Version Tracking'!$C$4","v":"15.2"},{"$f":"'GREM Calculations'!B9","v":0},null,null,null,null,null,null,null,null,null,null,null,null,{"$f":"'GREM Calculations'!R9","v":0},{"$f":"Q45","v":0},0,null,{"$f":"'GREM Calculations'!O9","v":0},{"$f":"'GREM Calculations'!N9","v":0},{"$f":"'GREM Calculations'!C9","v":0},{"$f":"'GREM Calculations'!T9","v":15},{"$f":"'GREM Calculations'!D9","v":0},null,{"$f":"'GREM Calculations'!H9","v":0},null,null,null,null,null,{"$f":"'GREM Calculations'!E9","v":0},null,null,null,null,"GRC",{"$f":"'GREM Calculations'!F9","v":0},{"$f":"'GREM Calculations'!G9","v":0}]
["GRC",{"$f":"IF('GREM Calculations'!K10=\"Yes\",\"Yes\",\"No\")","v":"No"},{"$f":"'Version Tracking'!$C$4","v":"15.2"},{"$f":"'GREM Calculations'!B10","v":0},null,null,null,null,null,null,null,null,null,null,null,null,{"$f":"'GREM Calculations'!R10","v":0},{"$f":"Q46","v":0},0,null,{"$f":"'GREM Calculations'!O10","v":0},{"$f":"'GREM Calculations'!N10","v":0},{"$f":"'GREM Calculations'!C10","v":0},{"$f":"'GREM Calculations'!T10","v":15},{"$f":"'GREM Calculations'!D10","v":0},null,{"$f":"'GREM Calculations'!H10","v":0},null,null,null,null,null,{"$f":"'GREM Calculations'!E10","v":0},null,null,null,null,"GRC",{"$f":"'GREM Calculations'!F10","v":0},{"$f":"'GREM Calculations'!G10","v":0}]
["GRC",{"$f":"IF('GREM Calculations'!K11=\"Yes\",\"Yes\",\"No\")","v":"No"},{"$f":"'Version Tracking'!$C$4","v":"15.2"},{"$f":"'GREM Calculations'!B11","v":0},null,null,null,null,null,null,null,null,null,null,null,null,{"$f":"'GREM Calculations'!R11","v":0},0,0,null,{"$f":"'GREM Calculations'!O11","v":0},{"$f":"'GREM Calculations'!N11","v":0},{"$f":"'GREM Calculations'!C11","v":0},{"$f":"'GREM Calculations'!T11","v":15},{"$f":"'GREM Calculations'!D11","v":0},null,{"$f":"'GREM Calculations'!H11","v":0},null,null,null,null,null,{"$f":"'GREM Calculations'!E11","v":0},null,null,null,null,"GRC",{"$f":"'GREM Calculations'!F11","v":0},{"$f":"'GREM Calculations'!G11","v":0}]
["GRC",{"$f":"IF('GREM Calculations'!K12=\"Yes\",\"Yes\",\"No\")","v":"No"},{"$f":"'Version Tracking'!$C$4","v":"15.2"},{"$f":"'GREM Calculations'!B12","v":0},null,null,null,null,null,null,null,null,null,null,null,null,{"$f":"'GREM Calculations'!R12","v":0},0,0,null,{"$f":"'GREM Calculations'!O12","v":0},{"$f":"'GREM Calculations'!N12","v":0},{"$f":"'GREM Calculations'!C12","v":0},{"$f":"'GREM Calculations'!T12","v":15},{"$f":"'GREM Calculations'!D12","v":0},null,{"$f":"'GREM Calculations'!H12","v":0},null,null,null,null,null,{"$f":"'GREM Calculations'!E12","v":0},null,null,null,null,"GRC",{"$f":"'GREM Calculations'!F12","v":0},{"$f":"'GREM Calculations'!G12","v":0}]
["GRC",{"$f":"IF('GREM Calculations'!K13=\"Yes\",\"Yes\",\"No\")","v":"No"},{"$f":"'Version Tracking'!$C$4","v":"15.2"},{"$f":"'GREM Calculations'!B13","v":0},null,null,null,null,null,null,null,null,null,null,null,null,{"$f":"'GREM Calculations'!R13","v":0},0,0,null,{"$f":"'GREM Calculations'!O13","v":0},{"$f":"'GREM Calculations'!N13","v":0},{"$f":"'GREM Calculations'!C13","v":0},{"$f":"'GREM Calculations'!T13","v":15},{"$f":"'GREM Calculations'!D13","v":0},null,{"$f":"'GREM Calculations'!H13","v":0},null,null,null,null,null,{"$f":"'GREM Calculations'!E13","v":0},null,null,null,null,"GRC",{"$f":"'GREM Calculations'!F13","v":0},{"$f":"'GREM Calculations'!G13","v":0}]
["GRC",{"$f":"IF('GREM Calculations'!K14=\"Yes\",\"Yes\",\"No\")","v":"No"},{"$f":"'Version Tracking'!$C$4","v":"15.2"},{"$f":"'GREM Calculations'!B14","v":0},null,null,null,null,null,null,null,null,null,null,null,null,{"$f":"'GREM Calculations'!R14","v":0},0,0,null,{"$f":"'GREM Calculations'!O14","v":0},{"$f":"'GREM Calculations'!N14","v":0},{"$f":"'GREM Calculations'!C14","v":0},{"$f":"'GREM Calculations'!T14","v":15},{"$f":"'GREM Calculations'!D14","v":0},null,{"$f":"'GREM Calculations'!H14","v":0},null,null,null,null,null,{"$f":"'GREM Calculations'!E14","v":0},null,null,null,null,"GRC",{"$f":"'GREM Calculations'!F14","v":0},{"$f":"'GREM Calculations'!G14","v":0}]
["GRC",{"$f":"IF('GREM Calculations'!K15=\"Yes\",\"Yes\",\"No\")","v":"No"},{"$f":"'Version Tracking'!$C$4","v":"15.2"},{"$f":"'GREM Calculations'!B15","v":0},null,null,null,null,null,null,null,null,null,null,null,null,{"$f":"'GREM Calculations'!R15","v":0},0,0,null,{"$f":"'GREM Calculations'!O15","v":0},{"$f":"'GREM Calculations'!N15","v":0},{"$f":"'GREM Calculations'!C15","v":0},{"$f":"'GREM Calculations'!T15","v":15},{"$f":"'GREM Calculations'!D15","v":0},null,{"$f":"'GREM Calculations'!H15","v":0},null,null,null,null,null,{"$f":"'GREM Calculations'!E15","v":0},null,null,null,null,"GRC",{"$f":"'GREM Calculations'!F15","v":0},{"$f":"'GREM Calculations'!G15","v":0}]
["GRC",{"$f":"IF('GREM Calculations'!K16=\"Yes\",\"Yes\",\"No\")","v":"No"},{"$f":"'Version Tracking'!$C$4","v":"15.2"},{"$f":"'GREM Calculations'!B16","v":0},null,null,null,null,null,null,null,null,null,null,null,null,{"$f":"'GREM Calculations'!R16","v":0},0,0,null,{"$f":"'GREM Calculations'!O16","v":0},{"$f":"'GREM Calculations'!N16","v":0},{"$f":"'GREM Calculations'!C16","v":0},{"$f":"'GREM Calculations'!T16","v":15},{"$f":"'GREM Calculations'!D16","v":0},null,{"$f":"'GREM Calculations'!H16","v":0},null,null,null,null,null,{"$f":"'GREM Calculations'!E16","v":0},null,null,null,null,"GRC",{"$f":"'GREM Calculations'!F16","v":0},{"$f":"'GREM Calculations'!G16","v":0}]
["GRC",{"$f":"IF('GREM Calculations'!K17=\"Yes\",\"Yes\",\"No\")","v":"No"},{"$f":"'Version Tracking'!$C$4","v":"15.2"},{"$f":"'GREM Calculations'!B17","v":0},null,null,null,null,null,null,null,null,null,null,null,null,{"$f":"'GREM Calculations'!R17","v":0},0,0,null,{"$f":"'GREM Calculations'!O17","v":0},{"$f":"'GREM Calculations'!N17","v":0},{"$f":"'GREM Calculations'!C17","v":0},{"$f":"'GREM Calculations'!T17","v":15},{"$f":"'GREM Calculations'!D17","v":0},null,{"$f":"'GREM Calculations'!H17","v":0},null,null,null,null,null,{"$f":"'GREM Calculations'!E17","v":0},null,null,null,null,"GRC",{"$f":"'GREM Calculations'!F17","v":0},{"$f":"'GREM Calculations'!G17","v":0}]
["GRC",{"$f":"IF('GREM Calculations'!K18=\"Yes\",\"Yes\",\"No\")","v":"No"},{"$f":"'Version Tracking'!$C$4","v":"15.2"},{"$f":"'GREM Calculations'!B18","v":0},null,null,null,null,null,null,null,null,null,null,null,null,{"$f":"'GREM Calculations'!R18","v":0},0,0,null,{"$f":"'GREM Calculations'!O18","v":0},{"$f":"'GREM Calculations'!N18","v":0},{"$f":"'GREM Calculations'!C18","v":0},{"$f":"'GREM Calculations'!T18","v":15},{"$f":"'GREM Calculations'!D18","v":0},null,{"$f":"'GREM Calculations'!H18","v":0},null,null,null,null,null,{"$f":"'GREM Calculations'!E18","v":0},null,null,null,null,"GRC",{"$f":"'GREM Calculations'!F18","v":0},{"$f":"'GREM Calculations'!G18","v":0}]
[null,"No"]
["HPWH",{"$f":"IF('HPWH Calcs'!P9=\"Yes\",\"Yes\",\"No\")","v":"No"},{"$f":"'Version Tracking'!$C$4","v":"15.2"},{"$f":"'HPWH Calcs'!A9","v":0},null,null,null,null,null,null,null,null,null,null,null,null,{"$f":"'HPWH Calcs'!AL9","v":500},{"$f":"Q56","v":500},{"$f":"U56","v":0},null,{"$f":"'HPWH Calcs'!AK9","v":0},{"$f":"'HPWH Calcs'!AJ9","v":0},{"$f":"'HPWH Calcs'!C9","v":0},15,{"$f":"'HPWH Calcs'!D9","v":0},null,{"$f":"'HPWH Calcs'!K9","v":0},null,null,null,null,null,{"$f":"'HPWH Calcs'!B9","v":0},null,null,null,null,"HPWH",null,null,{"$f":"'HPWH Calcs'!F9","v":0},{"$f":"'HPWH Calcs'!E9","v":0},{"$f":"'HPWH Calcs'!H9","v":0},null,{"$f":"'HPWH Calcs'!U9","v":"Very Small"}]
["HPWH",{"$f":"IF('HPWH Calcs'!P10=\"Yes\",\"Yes\",\"No\")","v":"No"},{"$f":"'Version Tracking'!$C$4","v":"15.2"},{"$f":"'HPWH Calcs'!A10","v":0},null,null,null,null,null,null,null,null,null,null,null,null,{"$f":"'HPWH Calcs'!AL10","v":500},{"$f":"Q57","v":500},{"$f":"U57","v":0},null,{"$f":"'HPWH Calcs'!AK10","v":0},{"$f":"'HPWH Calcs'!AJ10","v":0},{"$f":"'HPWH Calcs'!C10","v":0},15,{"$f":"'HPWH Calcs'!D10","v":0},null,{"$f":"'HPWH Calcs'!K10","v":0},null,null,null,null,null,{"$f":"'HPWH Calcs'!B10","v":0},null,null,null,null,"HPWH",null,null,{"$f":"'HPWH Calcs'!F10","v":0},{"$f":"'HPWH Calcs'!E10","v":0},{"$f":"'HPWH Calcs'!H10","v":0},null,{"$f":"'HPWH Calcs'!U10","v":"Very Small"}]
["HPWH",{"$f":"IF('HPWH Calcs'!P11=\"Yes\",\"Yes\",\"No\")","v":"No"},{"$f":"'Version Tracking'!$C$4","v":"15.2"},{"$f":"'HPWH Calcs'!A11","v":0},null,null,null,null,null,null,null,null,null,null,null,null,{"$f":"'HPWH Calcs'!AL11","v":500},500,0,null,{"$f":"'HPWH Calcs'!AK11","v":0},{"$f":"'HPWH Calcs'!AJ11","v":0},{"$f":"'HPWH Calcs'!C11","v":0},15,{"$f":"'HPWH Calcs'!D11","v":0},null,{"$f":"'HPWH Calcs'!K11","v":0},null,null,null,null,null,{"$f":"'HPWH Calcs'!B11","v":0},null,null,null,null,"HPWH",null,null,{"$f":"'HPWH Calcs'!F11","v":0},{"$f":"'HPWH Calcs'!E11","v":0},{"$f":"'HPWH Calcs'!H11","v":0},null,{"$f":"'HPWH Calcs'!U11","v":"Very Small"}]
["HPWH",{"$f":"IF('HPWH Calcs'!P12=\"Yes\",\"Yes\",\"No\")","v":"No"},{"$f":"'Version Tracking'!$C$4","v":"15.2"},{"$f":"'HPWH Calcs'!A12","v":0},null,null,null,null,null,null,null,null,null,null,null,null,{"$f":"'HPWH Calcs'!AL12","v":500},500,0,null,{"$f":"'HPWH Calcs'!AK12","v":0},{"$f":"'HPWH Calcs'!AJ12","v":0},{"$f":"'HPWH Calcs'!C12","v":0},15,{"$f":"'HPWH Calcs'!D12","v":0},null,{"$f":"'HPWH Calcs'!K12","v":0},null,null,null,null,null,{"$f":"'HPWH Calcs'!B12","v":0},null,null,null,null,"HPWH",null,null,{"$f":"'HPWH Calcs'!F12","v":0},{"$f":"'HPWH Calcs'!E12","v":0},{"$f":"'HPWH Calcs'!H12","v":0},null,{"$f":"'HPWH Calcs'!U12","v":"Very Small"}]
["HPWH",{"$f":"IF('HPWH Calcs'!P13=\"Yes\",\"Yes\",\"No\")","v":"No"},{"$f":"'Version Tracking'!$C$4","v":"15.2"},{"$f":"'HPWH Calcs'!A13","v":0},null,null,null,null,null,null,null,null,null,null,null,null,{"$f":"'HPWH Calcs'!AL13","v":500},500,0,null,{"$f":"'HPWH Calcs'!AK13","v":0},{"$f":"'HPWH Calcs'!AJ13","v":0},{"$f":"'HPWH Calcs'!C13","v":0},15,{"$f":"'HPWH Calcs'!D13","v":0},null,{"$f":"'HPWH Calcs'!K13","v":0},null,null,null,null,null,{"$f":"'HPWH Calcs'!B13","v":0},null,null,null,null,"HPWH",null,null,{"$f":"'HPWH Calcs'!F13","v":0},{"$f":"'HPWH Calcs'!E13","v":0},{"$f":"'HPWH Calcs'!H13","v":0},null,{"$f":"'HPWH Calcs'!U13","v":"Very Small"}]
["HPWH",{"$f":"IF('HPWH Calcs'!P14=\"Yes\",\"Yes\",\"No\")","v":"No"},{"$f":"'Version Tracking'!$C$4","v":"15.2"},{"$f":"'HPWH Calcs'!A14","v":0},null,null,null,null,null,null,null,null,null,null,null,null,{"$f":"'HPWH Calcs'!AL14","v":500},500,0,null,{"$f":"'HPWH Calcs'!AK14","v":0},{"$f":"'HPWH Calcs'!AJ14","v":0},{"$f":"'HPWH Calcs'!C14","v":0},15,{"$f":"'HPWH Calcs'!D14","v":0},null,{"$f":"'HPWH Calcs'!K14","v":0},null,null,null,null,null,{"$f":"'HPWH Calcs'!B14","v":0},null,null,null,null,"HPWH",null,null,{"$f":"'HPWH Calcs'!F14","v":0},{"$f":"'HPWH Calcs'!E14","v":0},{"$f":"'HPWH Calcs'!H14","v":0},null,{"$f":"'HPWH Calcs'!U14","v":"Very Small"}]
["HPWH",{"$f":"IF('HPWH Calcs'!P15=\"Yes\",\"Yes\",\"No\")","v":"No"},{"$f":"'Version Tracking'!$C$4","v":"15.2"},{"$f":"'HPWH Calcs'!A15","v":0},null,null,null,null,null,null,null,null,null,null,null,null,{"$f":"'HPWH Calcs'!AL15","v":500},500,0,null,{"$f":"'HPWH Calcs'!AK15","v":0},{"$f":"'HPWH Calcs'!AJ15","v":0},{"$f":"'HPWH Calcs'!C15","v":0},15,{"$f":"'HPWH Calcs'!D15","v":0},null,{"$f":"'HPWH Calcs'!K15","v":0},null,null,null,null,null,{"$f":"'HPWH Calcs'!B15","v":0},null,null,null,null,"HPWH",null,null,{"$f":"'HPWH Calcs'!F15","v":0},{"$f":"'HPWH Calcs'!E15","v":0},{"$f":"'HPWH Calcs'!H15","v":0},null,{"$f":"'HPWH Calcs'!U15","v":"Very Small"}]
["HPWH",{"$f":"IF('HPWH Calcs'!P16=\"Yes\",\"Yes\",\"No\")","v":"No"},{"$f":"'Version Tracking'!$C$4","v":"15.2"},{"$f":"'HPWH Calcs'!A16","v":0},null,null,null,null,null,null,null,null,null,null,null,null,{"$f":"'HPWH Calcs'!AL16","v":500},500,0,null,{"$f":"'HPWH Calcs'!AK16","v":0},{"$f":"'HPWH Calcs'!AJ16","v":0},{"$f":"'HPWH Calcs'!C16","v":0},15,{"$f":"'HPWH Calcs'!D16","v":0},null,{"$f":"'HPWH Calcs'!K16","v":0},null,null,null,null,null,{"$f":"'HPWH Calcs'!B16","v":0},null,null,null,null,"HPWH",null,null,{"$f":"'HPWH Calcs'!F16","v":0},{"$f":"'HPWH Calcs'!E16","v":0},{"$f":"'HPWH Calcs'!H16","v":0},null,{"$f":"'HPWH Calcs'!U16","v":"Very Small"}]
["HPWH",{"$f":"IF('HPWH Calcs'!P17=\"Yes\",\"Yes\",\"No\")","v":"No"},{"$f":"'Version Tracking'!$C$4","v":"15.2"},{"$f":"'HPWH Calcs'!A17","v":0},null,null,null,null,null,null,null,null,null,null,null,null,{"$f":"'HPWH Calcs'!AL17","v":500},500,0,null,{"$f":"'HPWH Calcs'!AK17","v":0},{"$f":"'HPWH Calcs'!AJ17","v":0},{"$f":"'HPWH Calcs'!C17","v":0},15,{"$f":"'HPWH Calcs'!D17","v":0},null,{"$f":"'HPWH Calcs'!K17","v":0},null,null,null,null,null,{"$f":"'HPWH Calcs'!B17","v":0},null,null,null,null,"HPWH",null,null,{"$f":"'HPWH Calcs'!F17","v":0},{"$f":"'HPWH Calcs'!E17","v":0},{"$f":"'HPWH Calcs'!H17","v":0},null,{"$f":"'HPWH Calcs'!U17","v":"Very Small"}]
["HPWH",{"$f":"IF('HPWH Calcs'!P18=\"Yes\",\"Yes\",\"No\")","v":"No"},{"$f":"'Version Tracking'!$C$4","v":"15.2"},{"$f":"'HPWH Calcs'!A18","v":0},null,null,null,null,null,null,null,null,null,null,null,null,{"$f":"'HPWH Calcs'!AL18","v":500},500,0,null,{"$f":"'HPWH Calcs'!AK18","v":0},{"$f":"'HPWH Calcs'!AJ18","v":0},{"$f":"'HPWH Calcs'!C18","v":0},15,{"$f":"'HPWH Calcs'!D18","v":0},null,{"$f":"'HPWH Calcs'!K18","v":0},null,null,null,null,null,{"$f":"'HPWH Calcs'!B18","v":0},null,null,null,null,"HPWH",null,null,{"$f":"'HPWH Calcs'!F18","v":0},{"$f":"'HPWH Calcs'!E18","v":0},{"$f":"'HPWH Calcs'!H18","v":0},null,{"$f":"'HPWH Calcs'!U18","v":"Very Small"}]
[null,"No","VFD"]
["VFD",{"$f":"IF(VFDs!H26>0,\"Yes\",\"No\")","v":"No"},{"$f":"'Version Tracking'!$C$4","v":"15.2"},{"$f":"VFDs!C26","v":0},null,null,null,null,null,null,null,null,null,null,null,null,{"$f":"VFDs!J26","v":0},{"$f":"VFDs!R26","v":0},{"$f":"U67","v":0},{"$f":"VFDs!P26","v":0},{"$f":"VFDs!Q26","v":0},{"$f":"VFDs!O26","v":0},{"$f":"VFDs!D26","v":0},10,null,null,{"$f":"VFDs!H26","v":0},null,null,null,null,null,{"$f":"VFDs!B26","v":0},{"$f":"VFDs!E26","v":0},null,null,null,"VFD",null,null,null,null,{"$f":"VFDs!I26","v":0},{"$f":"VFDs!F26","v":0}]
["VFD",{"$f":"IF(VFDs!H27>0,\"Yes\",\"No\")","v":"No"},{"$f":"'Version Tracking'!$C$4","v":"15.2"},{"$f":"VFDs!C27","v":0},null,null,null,null,null,null,null,null,null,null,null,null,{"$f":"VFDs!J27","v":""},{"$f":"VFDs!R27","v":0},{"$f":"U68","v":""},{"$f":"VFDs!P27","v":""},{"$f":"VFDs!Q27","v":""},{"$f":"VFDs!O27","v":""},{"$f":"VFDs!D27","v":0},10,null,null,{"$f":"VFDs!H27","v":0},null,null,null,null,null,{"$f":"VFDs!B27","v":0},{"$f":"VFDs!E27","v":0},null,null,null,"VFD",null,null,null,null,{"$f":"VFDs!I27","v":0},{"$f":"VFDs!F27","v":0}]
["VFD",{"$f":"IF(VFDs!H28>0,\"Yes\",\"No\")","v":"No"},{"$f":"'Version Tracking'!$C$4","v":"15.2"},{"$f":"VFDs!C28","v":0},null,null,null,null,null,null,null,null,null,null,null,null,{"$f":"VFDs!J28","v":""},{"$f":"VFDs!R28","v":0},"",{"$f":"VFDs!P28","v":""},{"$f":"VFDs!Q28","v":""},{"$f":"VFDs!O28","v":""},{"$f":"VFDs!D28","v":0},10,null,null,{"$f":"VFDs!H28","v":0},null,null,null,null,null,{"$f":"VFDs!B28","v":0},{"$f":"VFDs!E28","v":0},null,null,null,"VFD",null,null,null,null,{"$f":"VFDs!I28","v":0},{"$f":"VFDs!F28","v":0}]
["VFD",{"$f":"IF(VFDs!H29>0,\"Yes\",\"No\")","v":"No"},{"$f":"'Version Tracking'!$C$4","v":"15.2"},{"$f":"VFDs!C29","v":0},null,null,null,null,null,null,null,null,null,null,null,null,{"$f":"VFDs!J29","v":""},{"$f":"VFDs!R29","v":0},"",{"$f":"VFDs!P29","v":""},{"$f":"VFDs!Q29","v":""},{"$f":"VFDs!O29","v":""},{"$f":"VFDs!D29","v":0},10,null,null,{"$f":"VFDs!H29","v":0},null,null,null,null,null,{"$f":"VFDs!B29","v":0},{"$f":"VFDs!E29","v":0},null,null,null,"VFD",null,null,null,null,{"$f":"VFDs!I29","v":0},{"$f":"VFDs!F29","v":0}]
["VFD",{"$f":"IF(VFDs!H30>0,\"Yes\",\"No\")","v":"No"},{"$f":"'Version Tracking'!$C$4","v":"15.2"},{"$f":"VFDs!C30","v":0},null,null,null,null,null,null,null,null,null,null,null,null,{"$f":"VFDs!J30","v":""},{"$f":"VFDs!R30","v":0},"",{"$f":"VFDs!P30","v":""},{"$f":"VFDs!Q30","v":""},{"$f":"VFDs!O30","v":""},{"$f":"VFDs!D30","v":0},10,null,null,{"$f":"VFDs!H30","v":0},null,null,null,null,null,{"$f":"VFDs!B30","v":0},{"$f":"VFDs!E30","v":0},null,null,null,"VFD",null,null,null,null,{"$f":"VFDs!I30","v":0},{"$f":"VFDs!F30","v":0}]
["VFD",{"$f":"IF(VFDs!H31>0,\"Yes\",\"No\")","v":"No"},{"$f":"'Version Tracking'!$C$4","v":"15.2"},{"$f":"VFDs!C31","v":0},null,null,null,null,null,null,null,null,null,null,null,null,{"$f":"VFDs!J31","v":""},{"$f":"VFDs!R31","v":0},"",{"$f":"VFDs!P31","v":""},{"$f":"VFDs!Q31","v":""},{"$f":"VFDs!O31","v":""},{"$f":"VFDs!D31","v":0},10,null,null,{"$f":"VFDs!H31","v":0},null,null,null,null,null,{"$f":"VFDs!B31","v":0},{"$f":"VFDs!E31","v":0},null,null,null,"VFD",null,null,null,null,{"$f":"VFDs!I31","v":0},{"$f":"VFDs!F31","v":0}]
["VFD",{"$f":"IF(VFDs!H32>0,\"Yes\",\"No\")","v":"No"},{"$f":"'Version Tracking'!$C$4","v":"15.2"},{"$f":"VFDs!C32","v":0},null,null,null,null,null,null,null,null,null,null,null,null,{"$f":"VFDs!J32","v":""},{"$f":"VFDs!R32","v":0},"",{"$f":"VFDs!P32","v":""},{"$f":"VFDs!Q32","v":""},{"$f":"VFDs!O32","v":""},{"$f":"VFDs!D32","v":0},10,null,null,{"$f":"VFDs!H32","v":0},null,null,null,null,null,{"$f":"VFDs!B32","v":0},{"$f":"VFDs!E32","v":0},null,null,null,"VFD",null,null,null,null,{"$f":"VFDs!I32","v":0},{"$f":"VFDs!F32","v":0}]
["VFD",{"$f":"IF(VFDs!H33>0,\"Yes\",\"No\")","v":"No"},{"$f":"'Version Tracking'!$C$4","v":"15.2"},{"$f":"VFDs!C33","v":0},null,null,null,null,null,null,null,null,null,null,null,null,{"$f":"VFDs!J33","v":""},{"$f":"VFDs!R33","v":0},"",{"$f":"VFDs!P33","v":""},{"$f":"VFDs!Q33","v":""},{"$f":"VFDs!O33","v":""},{"$f":"VFDs!D33","v":0},10,null,null,{"$f":"VFDs!H33","v":0},null,null,null,null,null,{"$f":"VFDs!B33","v":0},{"$f":"VFDs!E33","v":0},null,null,null,"VFD",null,null,null,null,{"$f":"VFDs!I33","v":0},{"$f":"VFDs!F33","v":0}]
["VFD",{"$f":"IF(VFDs!H34>0,\"Yes\",\"No\")","v":"No"},{"$f":"'Version Tracking'!$C$4","v":"15.2"},{"$f":"VFDs!C34","v":0},null,null,null,null,null,null,null,null,null,null,null,null,{"$f":"VFDs!J34","v":""},{"$f":"VFDs!R34","v":0},"",{"$f":"VFDs!P34","v":""},{"$f":"VFDs!Q34","v":""},{"$f":"VFDs!O34","v":""},{"$f":"VFDs!D34","v":0},10,null,null,{"$f":"VFDs!H34","v":0},null,null,null,null,null,{"$f":"VFDs!B34","v":0},{"$f":"VFDs!E34","v":0},null,null,null,"VFD",null,null,null,null,{"$f":"VFDs!I34","v":0},{"$f":"VFDs!F34","v":0}]
["VFD",{"$f":"IF(VFDs!H35>0,\"Yes\",\"No\")","v":"No"},{"$f":"'Version Tracking'!$C$4","v":"15.2"},{"$f":"VFDs!C35","v":0},null,null,null,null,null,null,null,null,null,null,null,null,{"$f":"VFDs!J35","v":""},{"$f":"VFDs!R35","v":0},"",{"$f":"VFDs!P35","v":""},{"$f":"VFDs!Q35","v":""},{"$f":"VFDs!O35","v":""},{"$f":"VFDs!D35","v":0},10,null,null,{"$f":"VFDs!H35","v":0},null,null,null,null,null,{"$f":"VFDs!B35","v":0},{"$f":"VFDs!E35","v":0},null,null,null,"VFD",null,null,null,null,{"$f":"VFDs!I35","v":0},{"$f":"VFDs!F35","v":0}]
[null,"No","Chiller"]
[{"$f":"'HVAC Chillers'!Q12","v":"ACC"},{"$f":"IF('HVAC Chillers'!E12>0,\"Yes\",\"No\")","v":"No"},{"$f":"'Version Tracking'!$C$4","v":"15.2"},{"$f":"'HVAC Chillers'!D12","v":0},{"$f":"'HVAC Chillers'!F12","v":0},null,null,null,null,null,null,null,{"$f":"'HVAC Chillers'!I12","v":20},{"$f":"'HVAC Chillers'!J12","v":0},{"$f":"'HVAC Chillers'!K12","v":3},{"$f":"'HVAC Chillers'!L12","v":0},{"$f":"'HVAC Chillers'!M12","v":0},{"$f":"Q78/AB78","v":{"$error":"#DIV/0!"}},{"$f":"U78","v":""},{"$f":"'HVAC Chillers'!Y12","v":""},{"$f":"'HVAC Chillers'!Z12","v":""},{"$f":"'HVAC Chillers'!X12","v":""},null,20,null,{"$f":"IF($B78=\"Yes\",$A78,\"\")","v":""},{"$f":"IF($B78=\"Yes\",1,\"\")","v":""},{"$f":"'HVAC Chillers'!E12","v":0}]
[{"$f":"'HVAC Chillers'!Q14","v":"ACC"},{"$f":"IF('HVAC Chillers'!E14>0,\"Yes\",\"No\")","v":"No"},{"$f":"'Version Tracking'!$C$4","v":"15.2"},{"$f":"'HVAC Chillers'!D14","v":0},{"$f":"'HVAC Chillers'!F14","v":0},null,null,null,null,null,null,null,{"$f":"'HVAC Chillers'!I14","v":20},{"$f":"'HVAC Chillers'!J14","v":0},{"$f":"'HVAC Chillers'!K14","v":3},{"$f":"'HVAC Chillers'!L14","v":0},{"$f":"'HVAC Chillers'!M14","v":0},{"$f":"Q79/AB79","v":{"$error":"#DIV/0!"}},{"$f":"U79","v":0},{"$f":"'HVAC Chillers'!Y14","v":""},{"$f":"'HVAC Chillers'!Z14","v":0},{"$f":"'HVAC Chillers'!X14","v":""},null,20,null,{"$f":"IF($B79=\"Yes\",$A79,\"\")","v":""},{"$f":"IF($B79=\"Yes\",1,\"\")","v":""},{"$f":"'HVAC Chillers'!E14","v":0}]
[{"$f":"'HVAC Chillers'!Q16","v":"WCSC"},{"$f":"IF('HVAC Chillers'!E16>0,\"Yes\",\"No\")","v":"No"},{"$f":"'Version Tracking'!$C$4","v":"15.2"},{"$f":"'HVAC Chillers'!D16","v":0},{"$f":"'HVAC Chillers'!F16","v":0},null,null,null,null,null,null,null,{"$f":"'HVAC Chillers'!I16","v":35},{"$f":"'HVAC Chillers'!J16","v":0},{"$f":"'HVAC Chillers'!K16","v":4},{"$f":"'HVAC Chillers'!L16","v":0},{"$f":"'HVAC Chillers'!M16","v":0},{"$error":"#DIV/0!"},0,{"$f":"'HVAC Chillers'!Y16","v":0},{"$f":"'HVAC Chillers'!Z16","v":0},{"$f":"'HVAC Chillers'!X16","v":""},null,20,null,"","",{"$f":"'HVAC Chillers'!E16","v":0}]
[{"$f":"'HVAC Chillers'!Q18","v":"WCSC"},{"$f":"IF('HVAC Chillers'!E18>0,\"Yes\",\"No\")","v":"No"},{"$f":"'Version Tracking'!$C$4","v":"15.2"},{"$f":"'HVAC Chillers'!D18","v":0},{"$f":"'HVAC Chillers'!F18","v":0},null,null,null,null,null,null,null,{"$f":"'HVAC Chillers'!I18","v":35},{"$f":"'HVAC Chillers'!J18","v":0},{"$f":"'HVAC Chillers'!K18","v":3},{"$f":"'HVAC Chillers'!L18","v":0},{"$f":"'HVAC Chillers'!M18","v":0},{"$error":"#DIV/0!"},0,{"$f":"'HVAC Chillers'!Y18","v":0},{"$f":"'HVAC Chillers'!Z18","v":0},{"$f":"'HVAC Chillers'!X18","v":""},null,20,null,"","",{"$f":"'HVAC Chillers'!E18","v":0}]
[{"$f":"'HVAC Chillers'!Q20","v":"WCSC"},{"$f":"IF('HVAC Chillers'!E20>0,\"Yes\",\"No\")","v":"No"},{"$f":"'Version Tracking'!$C$4","v":"15.2"},{"$f":"'HVAC Chillers'!D20","v":0},{"$f":"'HVAC Chillers'!F20","v":0},null,null,null,null,null,null,null,{"$f":"'HVAC Chillers'!I20","v":25},{"$f":"'HVAC Chillers'!J20","v":0},{"$f":"'HVAC Chillers'!K20","v":2},{"$f":"'HVAC Chillers'!L20","v":0},{"$f":"'HVAC Chillers'!M20","v":0},{"$error":"#DIV/0!"},0,{"$f":"'HVAC Chillers'!Y20","v":0},{"$f":"'HVAC Chillers'!Z20","v":0},{"$f":"'HVAC Chillers'!X20","v":""},null,20,null,"","",{"$f":"'HVAC Chillers'!E20","v":0}]
[{"$f":"'HVAC Chillers'!Q22","v":"WCRC"},{"$f":"IF('HVAC Chillers'!E22>0,\"Yes\",\"No\")","v":"No"},{"$f":"'Version Tracking'!$C$4","v":"15.2"},{"$f":"'HVAC Chillers'!D22","v":0},{"$f":"'HVAC Chillers'!F22","v":0},null,null,null,null,null,null,null,{"$f":"'HVAC Chillers'!I22","v":35},{"$f":"'HVAC Chillers'!J22","v":0},{"$f":"'HVAC Chillers'!K22","v":4},{"$f":"'HVAC Chillers'!L22","v":0},{"$f":"'HVAC Chillers'!M22","v":0},{"$error":"#DIV/0!"},0,{"$f":"'HVAC Chillers'!Y22","v":0},{"$f":"'HVAC Chillers'!Z22","v":0},{"$f":"'HVAC Chillers'!X22","v":""},null,20,null,"","",{"$f":"'HVAC Chillers'!E22","v":0}]
[{"$f":"'HVAC Chillers'!Q24","v":"WCRC"},{"$f":"IF('HVAC Chillers'!E24>0,\"Yes\",\"No\")","v":"No"},{"$f":"'Version Tracking'!$C$4","v":"15.2"},{"$f":"'HVAC Chillers'!D24","v":0},{"$f":"'HVAC Chillers'!F24","v":0},null,null,null,null,null,null,null,{"$f":"'HVAC Chillers'!I24","v":35},{"$f":"'HVAC Chillers'!J24","v":0},{"$f":"'HVAC Chillers'!K24","v":3},{"$f":"'HVAC Chillers'!L24","v":0},{"$f":"'HVAC Chillers'!M24","v":0},{"$error":"#DIV/0!"},0,{"$f":"'HVAC Chillers'!Y24","v":0},{"$f":"'HVAC Chillers'!Z24","v":0},{"$f":"'HVAC Chillers'!X24","v":""},null,20,null,"","",{"$f":"'HVAC Chillers'!E24","v":0}]
[{"$f":"'HVAC Chillers'!Q26","v":"WCRC"},{"$f":"IF('HVAC Chillers'!E26>0,\"Yes\",\"No\")","v":"No"},{"$f":"'Version Tracking'!$C$4","v":"15.2"},{"$f":"'HVAC Chillers'!D26","v":0},{"$f":"'HVAC Chillers'!F26","v":0},null,null,null,null,null,null,null,{"$f":"'HVAC Chillers'!I26","v":25},{"$f":"'HVAC Chillers'!J26","v":0},{"$f":"'HVAC Chillers'!K26","v":2},{"$f":"'HVAC Chillers'!L26","v":0},{"$f":"'HVAC Chillers'!M26","v":0},{"$error":"#DIV/0!"},0,{"$f":"'HVAC Chillers'!Y26","v":0},{"$f":"'HVAC Chillers'!Z26","v":0},{"$f":"'HVAC Chillers'!X26","v":""},null,20,null,"","",{"$f":"'HVAC Chillers'!E26","v":0}]
[{"$f":"'HVAC Chillers'!Q28","v":"WCCC"},{"$f":"IF('HVAC Chillers'!E28>0,\"Yes\",\"No\")","v":"No"},{"$f":"'Version Tracking'!$C$4","v":"15.2"},{"$f":"'HVAC Chillers'!D28","v":0},{"$f":"'HVAC Chillers'!F28","v":0},null,null,null,null,null,null,null,{"$f":"'HVAC Chillers'!I28","v":20},{"$f":"'HVAC Chillers'!J28","v":0},{"$f":"'HVAC Chillers'!K28","v":3},{"$f":"'HVAC Chillers'!L28","v":0},{"$f":"'HVAC Chillers'!M28","v":0},{"$error":"#DIV/0!"},0,{"$f":"'HVAC Chillers'!Y28","v":0},{"$f":"'HVAC Chillers'!Z28","v":0},{"$f":"'HVAC Chillers'!X28","v":""},null,20,null,"","",{"$f":"'HVAC Chillers'!E28","v":0}]
[{"$f":"'HVAC Chillers'!Q30","v":"WCCC"},{"$f":"IF('HVAC Chillers'!E30>0,\"Yes\",\"No\")","v":"No"},{"$f":"'Version Tracking'!$C$4","v":"15.2"},{"$f":"'HVAC Chillers'!D30","v":0},{"$f":"'HVAC Chillers'!F30","v":0},null,null,null,null,null,null,null,{"$f":"'HVAC Chillers'!I30","v":20},{"$f":"'HVAC Chillers'!J30","v":0},{"$f":"'HVAC Chillers'!K30","v":3},{"$f":"'HVAC Chillers'!L30","v":0},{"$f":"'HVAC Chillers'!M30","v":0},{"$error":"#DIV/0!"},0,{"$f":"'HVAC Chillers'!Y30","v":0},{"$f":"'HVAC Chillers'!Z30","v":0},{"$f":"'HVAC Chillers'!X30","v":""},null,20,null,"","",{"$f":"'HVAC Chillers'!E30","v":0}]
[{"$f":"'HVAC Chillers'!Q32","v":"WCCC"},{"$f":"IF('HVAC Chillers'!E32>0,\"Yes\",\"No\")","v":"No"},{"$f":"'Version Tracking'!$C$4","v":"15.2"},{"$f":"'HVAC Chillers'!D32","v":0},{"$f":"'HVAC Chillers'!F32","v":0},null,null,null,null,null,null,null,{"$f":"'HVAC Chillers'!I32","v":20},{"$f":"'HVAC Chillers'!J32","v":0},{"$f":"'HVAC Chillers'!K32","v":2},{"$f":"'HVAC Chillers'!L32","v":0},{"$f":"'HVAC Chillers'!M32","v":0},{"$error":"#DIV/0!"},0,{"$f":"'HVAC Chillers'!Y32","v":0},{"$f":"'HVAC Chillers'!Z32","v":0},{"$f":"'HVAC Chillers'!X32","v":""},null,20,null,"","",{"$f":"'HVAC Chillers'!E32","v":0}]
[{"$f":"'HVAC Chillers'!Q48","v":"ACC"},{"$f":"IF('HVAC Chillers'!E48>0,\"Yes\",\"No\")","v":"No"},{"$f":"'Version Tracking'!$C$4","v":"15.2"},{"$f":"'HVAC Chillers'!D48","v":0},{"$f":"'HVAC Chillers'!F48","v":0},null,null,null,null,null,null,null,{"$f":"'HVAC Chillers'!I48","v":10},{"$f":"'HVAC Chillers'!J48","v":0},{"$f":"'HVAC Chillers'!K48","v":4},{"$f":"'HVAC Chillers'!L48","v":0},{"$f":"'HVAC Chillers'!M48","v":0},{"$error":"#DIV/0!"},"",{"$f":"'HVAC Chillers'!Y48","v":""},{"$f":"'HVAC Chillers'!Z48","v":""},{"$f":"'HVAC Chillers'!X48","v":""},null,20,null,"","",{"$f":"'HVAC Chillers'!E48","v":0}]
[{"$f":"'HVAC Chillers'!Q50","v":"ACC"},{"$f":"IF('HVAC Chillers'!E50>0,\"Yes\",\"No\")","v":"No"},{"$f":"'Version Tracking'!$C$4","v":"15.2"},{"$f":"'HVAC Chillers'!D50","v":0},{"$f":"'HVAC Chillers'!F50","v":0},null,null,null,null,null,null,null,{"$f":"'HVAC Chillers'!I50","v":10},{"$f":"'HVAC Chillers'!J50","v":0},{"$f":"'HVAC Chillers'!K50","v":4},{"$f":"'HVAC Chillers'!L50","v":0},{"$f":"'HVAC Chillers'!M50","v":0},{"$error":"#DIV/0!"},0,{"$f":"'HVAC Chillers'!Y50","v":""},{"$f":"'HVAC Chillers'!Z50","v":0},{"$f":"'HVAC Chillers'!X50","v":""},null,20,null,"","",{"$f":"'HVAC Chillers'!E50","v":0}]
[{"$f":"'HVAC Chillers'!Q52","v":"WCSC"},{"$f":"IF('HVAC Chillers'!E52>0,\"Yes\",\"No\")","v":"No"},{"$f":"'Version Tracking'!$C$4","v":"15.2"},{"$f":"'HVAC Chillers'!D52","v":0},{"$f":"'HVAC Chillers'!F52","v":0},null,null,null,null,null,null,null,{"$f":"'HVAC Chillers'!I52","v":20},{"$f":"'HVAC Chillers'!J52","v":0},{"$f":"'HVAC Chillers'!K52","v":6},{"$f":"'HVAC Chillers'!L52","v":0},{"$f":"'HVAC Chillers'!M52","v":0},{"$error":"#DIV/0!"},0,{"$f":"'HVAC Chillers'!Y52","v":0},{"$f":"'HVAC Chillers'!Z52","v":0},{"$f":"'HVAC Chillers'!X52","v":""},null,20,null,"","",{"$f":"'HVAC Chillers'!E52","v":0}]
[{"$f":"'HVAC Chillers'!Q54","v":"WCSC"},{"$f":"IF('HVAC Chillers'!E54>0,\"Yes\",\"No\")","v":"No"},{"$f":"'Version Tracking'!$C$4","v":"15.2"},{"$f":"'HVAC Chillers'!D54","v":0},{"$f":"'HVAC Chillers'!F54","v":0},null,null,null,null,null,null,null,{"$f":"'HVAC Chillers'!I54","v":15},{"$f":"'HVAC Chillers'!J54","v":0},{"$f":"'HVAC Chillers'!K54","v":6},{"$f":"'HVAC Chillers'!L54","v":0},{"$f":"'HVAC Chillers'!M54","v":0},{"$error":"#DIV/0!"},0,{"$f":"'HVAC Chillers'!Y54","v":0},{"$f":"'HVAC Chillers'!Z54","v":0},{"$f":"'HVAC Chillers'!X54","v":""},null,20,null,"","",{"$f":"'HVAC Chillers'!E54","v":0}]
[{"$f":"'HVAC Chillers'!Q56","v":"WCSC"},{"$f":"IF('HVAC Chillers'!E56>0,\"Yes\",\"No\")","v":"No"},{"$f":"'Version Tracking'!$C$4","v":"15.2"},{"$f":"'HVAC Chillers'!D56","v":0},{"$f":"'HVAC Chillers'!F56","v":0},null,null,null,null,null,null,null,{"$f":"'HVAC Chillers'!I56","v":10},{"$f":"'HVAC Chillers'!J56","v":0},{"$f":"'HVAC Chillers'!K56","v":3},{"$f":"'HVAC Chillers'!L56","v":0},{"$f":"'HVAC Chillers'!M56","v":0},{"$error":"#DIV/0!"},0,{"$f":"'HVAC Chillers'!Y56","v":0},{"$f":"'HVAC Chillers'!Z56","v":0},{"$f":"'HVAC Chillers'!X56","v":""},null,20,null,"","",{"$f":"'HVAC Chillers'!E56","v":0}]
[{"$f":"'HVAC Chillers'!Q58","v":"WCRC"},{"$f":"IF('HVAC Chillers'!E58>0,\"Yes\",\"No\")","v":"No"},{"$f":"'Version Tracking'!$C$4","v":"15.2"},{"$f":"'HVAC Chillers'!D58","v":0},{"$f":"'HVAC Chillers'!F58","v":0},null,null,null,null,null,null,null,{"$f":"'HVAC Chillers'!I58","v":20},{"$f":"'HVAC Chillers'!J58","v":0},{"$f":"'HVAC Chillers'!K58","v":6},{"$f":"'HVAC Chillers'!L58","v":0},{"$f":"'HVAC Chillers'!M58","v":0},{"$error":"#DIV/0!"},0,{"$f":"'HVAC Chillers'!Y58","v":0},{"$f":"'HVAC Chillers'!Z58","v":0},{"$f":"'HVAC Chillers'!X58","v":""},null,20,null,"","",{"$f":"'HVAC Chillers'!E58","v":0}]
[{"$f":"'HVAC Chillers'!Q60","v":"WCRC"},{"$f":"IF('HVAC Chillers'!E60>0,\"Yes\",\"No\")","v":"No"},{"$f":"'Version Tracking'!$C$4","v":"15.2"},{"$f":"'HVAC Chillers'!D60","v":0},{"$f":"'HVAC Chillers'!F60","v":0},null,null,null,null,null,null,null,{"$f":"'HVAC Chillers'!I60","v":15},{"$f":"'HVAC Chillers'!J60","v":0},{"$f":"'HVAC Chillers'!K60","v":6},{"$f":"'HVAC Chillers'!L60","v":0},{"$f":"'HVAC Chillers'!M60","v":0},{"$error":"#DIV/0!"},0,{"$f":"'HVAC Chillers'!Y60","v":0},{"$f":"'HVAC Chillers'!Z60","v":0},{"$f":"'HVAC Chillers'!X60","v":""},null,20,null,"","",{"$f":"'HVAC Chillers'!E60","v":0}]
[{"$f":"'HVAC Chillers'!Q62","v":"WCRC"},{"$f":"IF('HVAC Chillers'!E62>0,\"Yes\",\"No\")","v":"No"},{"$f":"'Version Tracking'!$C$4","v":"15.2"},{"$f":"'HVAC Chillers'!D62","v":0},{"$f":"'HVAC Chillers'!F62","v":0},null,null,null,null,null,null,null,{"$f":"'HVAC Chillers'!I62","v":10},{"$f":"'HVAC Chillers'!J62","v":0},{"$f":"'HVAC Chillers'!K62","v":3},{"$f":"'HVAC Chillers'!L62","v":0},{"$f":"'HVAC Chillers'!M62","v":0},{"$error":"#DIV/0!"},0,{"$f":"'HVAC Chillers'!Y62","v":0},{"$f":"'HVAC Chillers'!Z62","v":0},{"$f":"'HVAC Chillers'!X62","v":""},null,20,null,"","",{"$f":"'HVAC Chillers'!E62","v":0}]
[{"$f":"'HVAC Chillers'!Q64","v":"WCCC"},{"$f":"IF('HVAC Chillers'!E64>0,\"Yes\",\"No\")","v":"No"},{"$f":"'Version Tracking'!$C$4","v":"15.2"},{"$f":"'HVAC Chillers'!D64","v":0},{"$f":"'HVAC Chillers'!F64","v":0},null,null,null,null,null,null,null,{"$f":"'HVAC Chillers'!I64","v":10},{"$f":"'HVAC Chillers'!J64","v":0},{"$f":"'HVAC Chillers'!K64","v":5},{"$f":"'HVAC Chillers'!L64","v":0},{"$f":"'HVAC Chillers'!M64","v":0},{"$error":"#DIV/0!"},0,{"$f":"'HVAC Chillers'!Y64","v":0},{"$f":"'HVAC Chillers'!Z64","v":0},{"$f":"'HVAC Chillers'!X64","v":""},null,20,null,"","",{"$f":"'HVAC Chillers'!E64","v":0}]
[{"$f":"'HVAC Chillers'!Q66","v":"WCCC"},{"$f":"IF('HVAC Chillers'!E66>0,\"Yes\",\"No\")","v":"No"},{"$f":"'Version Tracking'!$C$4","v":"15.2"},{"$f":"'HVAC Chillers'!D66","v":0},{"$f":"'HVAC Chillers'!F66","v":0},null,null,null,null,null,null,null,{"$f":"'HVAC Chillers'!I66","v":10},{"$f":"'HVAC Chillers'!J66","v":0},{"$f":"'HVAC Chillers'!K66","v":4},{"$f":"'HVAC Chillers'!L66","v":0},{"$f":"'HVAC Chillers'!M66","v":0},{"$error":"#DIV/0!"},0,{"$f":"'HVAC Chillers'!Y66","v":0},{"$f":"'HVAC Chillers'!Z66","v":0},{"$f":"'HVAC Chillers'!X66","v":""},null,20,null,"","",{"$f":"'HVAC Chillers'!E66","v":0}]
[{"$f":"'HVAC Chillers'!Q68","v":"WCCC"},{"$f":"IF('HVAC Chillers'!E68>0,\"Yes\",\"No\")","v":"No"},{"$f":"'Version Tracking'!$C$4","v":"15.2"},{"$f":"'HVAC Chillers'!D68","v":0},{"$f":"'HVAC Chillers'!F68","v":0},null,null,null,null,null,null,null,{"$f":"'HVAC Chillers'!I68","v":10},{"$f":"'HVAC Chillers'!J68","v":0},{"$f":"'HVAC Chillers'!K68","v":3},{"$f":"'HVAC Chillers'!L68","v":0},{"$f":"'HVAC Chillers'!M68","v":0},{"$error":"#DIV/0!"},0,{"$f":"'HVAC Chillers'!Y68","v":0},{"$f":"'HVAC Chillers'!Z68","v":0},{"$f":"'HVAC Chillers'!X68","v":""},null,20,null,"","",{"$f":"'HVAC Chillers'!E68","v":0}]
[null,"No"]